Open MPI logo

Open MPI User's Mailing List Archives

  |   Home   |   Support   |   FAQ   |   all Open MPI User's mailing list

Subject: [OMPI users] errors while making openmpi
From: Hamed Mortazavi (hmd.mortazavi_at_[hidden])
Date: 2014-05-14 02:13:30


Hi all,

in make check for openmpi on a mac I see following error message, has
anybody ever run to this error? any solutions?

Best,

Hamed,

raw extraction in 1 microsec

Example 3.26 type1 correct

Example 3.26 type1 correct

Example 3.26 type2 correct

type3 correct

hindexed ok

indexed ok

hvector ok

vector ok

/bin/sh: line 1: 24364 Abort trap: 6 ${dir}$tst

FAIL: ddt_raw

========================================================

3 of 5 tests failed

Please report to http://www.open-mpi.org/community/help/

========================================================

make[3]: *** [check-TESTS] Error 1

make[2]: *** [check-am] Error 2

make[1]: *** [check-recursive] Error 1

make: *** [check-recursive] Error 1