Open MPI logo

Open MPI User's Mailing List Archives

  |   Home   |   Support   |   FAQ   |   all Open MPI User's mailing list

Subject: Re: [OMPI users] error building openmpi-1.7.3a1r29213 on Solaris
From: Siegmar Gross (Siegmar.Gross_at_[hidden])
Date: 2013-09-21 02:53:34


Hi,

thank you very much for fixing the bug so fast. I can compile
openmpi-1.7.3a1r29220 and it seems that it works. I will do some more
tests on Monday.

Kind regards

Siegmar

> I tried to install openmpi-1.7.3a1r29213 on "openSuSE Linux 12.1",
> "Solaris 10 x86_64", and "Solaris 10 sparc" with "Sun C 5.12" and
> gcc-4.8.0 in 64-bit mode. Unfortunately "make" breaks with the same
> error for both compilers on both Solaris platforms.
>
>
> tyr openmpi-1.7.3a1r29213-SunOS.sparc.64_cc 126 tail -10 \
> log.make.SunOS.sparc.64_cc
> Making all in mca/if/posix_ipv4
> make[2]: Entering directory `.../opal/mca/if/posix_ipv4'
> CC if_posix.lo
> "../../../../../openmpi-1.7.3a1r29213/opal/mca/if/posix_ipv4/if_posix.c",
> line 277: undefined struct/union member: ifr_mtu
> cc: acomp failed for
> ../../../../../openmpi-1.7.3a1r29213/opal/mca/if/posix_ipv4/if_posix.c
> make[2]: *** [if_posix.lo] Error 1
> make[2]: Leaving directory `.../opal/mca/if/posix_ipv4'
> make[1]: *** [all-recursive] Error 1
> make[1]: Leaving directory `.../opal'
> make: *** [all-recursive] Error 1