Open MPI logo

Open MPI User's Mailing List Archives

  |   Home   |   Support   |   FAQ   |   all Open MPI User's mailing list

Subject: [OMPI users] Errors compiling OpenMPI 1.2.8 with SUN Studio express (2008/07/10) in 32bit modus
From: Paul Kapinos (kapinos_at_[hidden])
Date: 2008-10-16 10:42:00


Hi all,

We tried to install OpenMPI 1.2.8 on Linux in a couple of versions here
(compiler from intel, pgi, studio, gcc - all 64bit and 32bit).

If we used SUN Studio Express (2008/07/10) and configured to produce
32bit library, we got following errors (full log see in file
my_makelog_sun32.txt)

..........
gmake[2]: Entering directory
`/rwthfs/rz/cluster/home/pk224850/OpenMPI/openmpi-1.2.8_studio32/ompi/mca/btl/openib'
source='btl_openib_component.c' object='btl_openib_component.lo'
libtool=yes \
        DEPDIR=.deps depmode=none /bin/sh ../../../../config/depcomp \
        /bin/sh ../../../../libtool --tag=CC --mode=compile cc
-DHAVE_CONFIG_H -I. -I../../../../opal/include
-I../../../../orte/include -I../../../../ompi/include
-DPKGDATADIR=\"/rwthfs/rz/SW/MPI/openmpi-1.2.8/linux32/studio/share/openmpi\"
-I../../../.. -DNDEBUG -O2 -m32 -c -o btl_openib_component.lo
btl_openib_component.c
libtool: compile: cc -DHAVE_CONFIG_H -I. -I../../../../opal/include
-I../../../../orte/include -I../../../../ompi/include
-DPKGDATADIR=\"/rwthfs/rz/SW/MPI/openmpi-1.2.8/linux32/studio/share/openmpi\"
-I../../../.. -DNDEBUG -O2 -m32 -c btl_openib_component.c -KPIC -DPIC
-o .libs/btl_openib_component.o
"../../../../opal/include/opal/sys/ia32/atomic.h", line 167: warning:
impossible constraint for "%1" asm operand
"../../../../opal/include/opal/sys/ia32/atomic.h", line 167: warning:
parameter in inline asm statement unused: %2
"../../../../opal/include/opal/sys/ia32/atomic.h", line 184: warning:
impossible constraint for "%1" asm operand
"../../../../opal/include/opal/sys/ia32/atomic.h", line 184: warning:
parameter in inline asm statement unused: %2
"/usr/include/infiniband/kern-abi.h", line 103: syntax error before or
at: __u64
"/usr/include/infiniband/kern-abi.h", line 109: syntax error before or
at: __u64
"/usr/include/infiniband/kern-abi.h", line 124: syntax error before or
at: __u64
"/usr/include/infiniband/kern-abi.h", line 135: syntax error before or
at: __u64
.......

This seems for us to be an error on linux headers in file kern-abi.h
which includes linux/types.h which contains this:

#if defined(__GNUC__) && !defined(__STRICT_ANSI__)
typedef __u64 uint64_t;
typedef __u64 u_int64_t;
typedef __s64 int64_t;
#endif

So, it looks for us so, that by byilding of openmpi 1.2.8 the SUN Studio
compiler cannot compile some Linux headers because of these are
programmed in "GNU C" instead of ANSI C.

If so then this is an Linux issue and not OpenMPI's - but, if so, *why*
did you not seen this problems during of release preparation? That is,
maybe we have done some mistakes? Maybe the devel headers and/or static
libs are the problem? (I will try to disable them, but we want to report
this problem anyway).

We use Scientific Linux 5.1 which is an Red Hat Enterprice 5 Linux.

$ uname -a
Linux linuxhtc01.rz.RWTH-Aachen.DE 2.6.18-53.1.14.el5_lustre.1.6.5custom
#1 SMP Wed Jun 25 12:17:09 CEST 2008 x86_64 x86_64 x86_64 GNU/Linux

configured with:

  ./configure --enable-static --with-devel-headers CFLAGS="-O2 -m32"
CXXFLAGS="-O2 -m32" FFLAGS="-O2 -m32" FCFLAGS="-O2 -m32" LDFLAGS="-m32"
--prefix=/rwthfs/rz/SW/MPI/openmpi-1.2.8/linux32/studio

Best regards,

Paul Kapinos
HPC Group
RZ RWTH Aachen

Making all in config
gmake[1]: Entering directory `/rwthfs/rz/cluster/home/pk224850/OpenMPI/openmpi-1.2.8_studio32/config'
gmake[1]: Nothing to be done for `all'.
gmake[1]: Leaving directory `/rwthfs/rz/cluster/home/pk224850/OpenMPI/openmpi-1.2.8_studio32/config'
Making all in contrib
gmake[1]: Entering directory `/rwthfs/rz/cluster/home/pk224850/OpenMPI/openmpi-1.2.8_studio32/contrib'
gmake[1]: Nothing to be done for `all'.
gmake[1]: Leaving directory `/rwthfs/rz/cluster/home/pk224850/OpenMPI/openmpi-1.2.8_studio32/contrib'
Making all in opal
gmake[1]: Entering directory `/rwthfs/rz/cluster/home/pk224850/OpenMPI/openmpi-1.2.8_studio32/opal'
Making all in include
gmake[2]: Entering directory `/rwthfs/rz/cluster/home/pk224850/OpenMPI/openmpi-1.2.8_studio32/opal/include'
gmake all-am
gmake[3]: Entering directory `/rwthfs/rz/cluster/home/pk224850/OpenMPI/openmpi-1.2.8_studio32/opal/include'
gmake[3]: Leaving directory `/rwthfs/rz/cluster/home/pk224850/OpenMPI/openmpi-1.2.8_studio32/opal/include'
gmake[2]: Leaving directory `/rwthfs/rz/cluster/home/pk224850/OpenMPI/openmpi-1.2.8_studio32/opal/include'
Making all in libltdl
gmake[2]: Entering directory `/rwthfs/rz/cluster/home/pk224850/OpenMPI/openmpi-1.2.8_studio32/opal/libltdl'
gmake all-am
gmake[3]: Entering directory `/rwthfs/rz/cluster/home/pk224850/OpenMPI/openmpi-1.2.8_studio32/opal/libltdl'
gmake[3]: Leaving directory `/rwthfs/rz/cluster/home/pk224850/OpenMPI/openmpi-1.2.8_studio32/opal/libltdl'
gmake[2]: Leaving directory `/rwthfs/rz/cluster/home/pk224850/OpenMPI/openmpi-1.2.8_studio32/opal/libltdl'
Making all in asm
gmake[2]: Entering directory `/rwthfs/rz/cluster/home/pk224850/OpenMPI/openmpi-1.2.8_studio32/opal/asm'
gmake[2]: Nothing to be done for `all'.
gmake[2]: Leaving directory `/rwthfs/rz/cluster/home/pk224850/OpenMPI/openmpi-1.2.8_studio32/opal/asm'
Making all in etc
gmake[2]: Entering directory `/rwthfs/rz/cluster/home/pk224850/OpenMPI/openmpi-1.2.8_studio32/opal/etc'
gmake[2]: Nothing to be done for `all'.
gmake[2]: Leaving directory `/rwthfs/rz/cluster/home/pk224850/OpenMPI/openmpi-1.2.8_studio32/opal/etc'
Making all in event
gmake[2]: Entering directory `/rwthfs/rz/cluster/home/pk224850/OpenMPI/openmpi-1.2.8_studio32/opal/event'
Making all in compat
gmake[3]: Entering directory `/rwthfs/rz/cluster/home/pk224850/OpenMPI/openmpi-1.2.8_studio32/opal/event/compat'
Making all in sys
gmake[4]: Entering directory `/rwthfs/rz/cluster/home/pk224850/OpenMPI/openmpi-1.2.8_studio32/opal/event/compat/sys'
gmake[4]: Nothing to be done for `all'.
gmake[4]: Leaving directory `/rwthfs/rz/cluster/home/pk224850/OpenMPI/openmpi-1.2.8_studio32/opal/event/compat/sys'
gmake[4]: Entering directory `/rwthfs/rz/cluster/home/pk224850/OpenMPI/openmpi-1.2.8_studio32/opal/event/compat'
gmake[4]: Nothing to be done for `all-am'.
gmake[4]: Leaving directory `/rwthfs/rz/cluster/home/pk224850/OpenMPI/openmpi-1.2.8_studio32/opal/event/compat'
gmake[3]: Leaving directory `/rwthfs/rz/cluster/home/pk224850/OpenMPI/openmpi-1.2.8_studio32/opal/event/compat'
gmake[3]: Entering directory `/rwthfs/rz/cluster/home/pk224850/OpenMPI/openmpi-1.2.8_studio32/opal/event'
gmake[3]: Nothing to be done for `all-am'.
gmake[3]: Leaving directory `/rwthfs/rz/cluster/home/pk224850/OpenMPI/openmpi-1.2.8_studio32/opal/event'
gmake[2]: Leaving directory `/rwthfs/rz/cluster/home/pk224850/OpenMPI/openmpi-1.2.8_studio32/opal/event'
Making all in util
gmake[2]: Entering directory `/rwthfs/rz/cluster/home/pk224850/OpenMPI/openmpi-1.2.8_studio32/opal/util'
Making all in keyval
gmake[3]: Entering directory `/rwthfs/rz/cluster/home/pk224850/OpenMPI/openmpi-1.2.8_studio32/opal/util/keyval'
gmake[3]: Nothing to be done for `all'.
gmake[3]: Leaving directory `/rwthfs/rz/cluster/home/pk224850/OpenMPI/openmpi-1.2.8_studio32/opal/util/keyval'
gmake[3]: Entering directory `/rwthfs/rz/cluster/home/pk224850/OpenMPI/openmpi-1.2.8_studio32/opal/util'
gmake[3]: Nothing to be done for `all-am'.
gmake[3]: Leaving directory `/rwthfs/rz/cluster/home/pk224850/OpenMPI/openmpi-1.2.8_studio32/opal/util'
gmake[2]: Leaving directory `/rwthfs/rz/cluster/home/pk224850/OpenMPI/openmpi-1.2.8_studio32/opal/util'
Making all in mca/base
gmake[2]: Entering directory `/rwthfs/rz/cluster/home/pk224850/OpenMPI/openmpi-1.2.8_studio32/opal/mca/base'
gmake[2]: Nothing to be done for `all'.
gmake[2]: Leaving directory `/rwthfs/rz/cluster/home/pk224850/OpenMPI/openmpi-1.2.8_studio32/opal/mca/base'
Making all in mca/backtrace
gmake[2]: Entering directory `/rwthfs/rz/cluster/home/pk224850/OpenMPI/openmpi-1.2.8_studio32/opal/mca/backtrace'
gmake[2]: Nothing to be done for `all'.
gmake[2]: Leaving directory `/rwthfs/rz/cluster/home/pk224850/OpenMPI/openmpi-1.2.8_studio32/opal/mca/backtrace'
Making all in mca/installdirs
gmake[2]: Entering directory `/rwthfs/rz/cluster/home/pk224850/OpenMPI/openmpi-1.2.8_studio32/opal/mca/installdirs'
gmake[2]: Nothing to be done for `all'.
gmake[2]: Leaving directory `/rwthfs/rz/cluster/home/pk224850/OpenMPI/openmpi-1.2.8_studio32/opal/mca/installdirs'
Making all in mca/maffinity
gmake[2]: Entering directory `/rwthfs/rz/cluster/home/pk224850/OpenMPI/openmpi-1.2.8_studio32/opal/mca/maffinity'
gmake[2]: Nothing to be done for `all'.
gmake[2]: Leaving directory `/rwthfs/rz/cluster/home/pk224850/OpenMPI/openmpi-1.2.8_studio32/opal/mca/maffinity'
Making all in mca/memcpy
gmake[2]: Entering directory `/rwthfs/rz/cluster/home/pk224850/OpenMPI/openmpi-1.2.8_studio32/opal/mca/memcpy'
gmake[2]: Nothing to be done for `all'.
gmake[2]: Leaving directory `/rwthfs/rz/cluster/home/pk224850/OpenMPI/openmpi-1.2.8_studio32/opal/mca/memcpy'
Making all in mca/memory
gmake[2]: Entering directory `/rwthfs/rz/cluster/home/pk224850/OpenMPI/openmpi-1.2.8_studio32/opal/mca/memory'
gmake[2]: Nothing to be done for `all'.
gmake[2]: Leaving directory `/rwthfs/rz/cluster/home/pk224850/OpenMPI/openmpi-1.2.8_studio32/opal/mca/memory'
Making all in mca/paffinity
gmake[2]: Entering directory `/rwthfs/rz/cluster/home/pk224850/OpenMPI/openmpi-1.2.8_studio32/opal/mca/paffinity'
gmake[2]: Nothing to be done for `all'.
gmake[2]: Leaving directory `/rwthfs/rz/cluster/home/pk224850/OpenMPI/openmpi-1.2.8_studio32/opal/mca/paffinity'
Making all in mca/timer
gmake[2]: Entering directory `/rwthfs/rz/cluster/home/pk224850/OpenMPI/openmpi-1.2.8_studio32/opal/mca/timer'
gmake[2]: Nothing to be done for `all'.
gmake[2]: Leaving directory `/rwthfs/rz/cluster/home/pk224850/OpenMPI/openmpi-1.2.8_studio32/opal/mca/timer'
Making all in mca/backtrace/execinfo
gmake[2]: Entering directory `/rwthfs/rz/cluster/home/pk224850/OpenMPI/openmpi-1.2.8_studio32/opal/mca/backtrace/execinfo'
gmake[2]: Nothing to be done for `all'.
gmake[2]: Leaving directory `/rwthfs/rz/cluster/home/pk224850/OpenMPI/openmpi-1.2.8_studio32/opal/mca/backtrace/execinfo'
Making all in mca/installdirs/env
gmake[2]: Entering directory `/rwthfs/rz/cluster/home/pk224850/OpenMPI/openmpi-1.2.8_studio32/opal/mca/installdirs/env'
gmake[2]: Nothing to be done for `all'.
gmake[2]: Leaving directory `/rwthfs/rz/cluster/home/pk224850/OpenMPI/openmpi-1.2.8_studio32/opal/mca/installdirs/env'
Making all in mca/installdirs/config
gmake[2]: Entering directory `/rwthfs/rz/cluster/home/pk224850/OpenMPI/openmpi-1.2.8_studio32/opal/mca/installdirs/config'
gmake[2]: Nothing to be done for `all'.
gmake[2]: Leaving directory `/rwthfs/rz/cluster/home/pk224850/OpenMPI/openmpi-1.2.8_studio32/opal/mca/installdirs/config'
Making all in mca/maffinity/first_use
gmake[2]: Entering directory `/rwthfs/rz/cluster/home/pk224850/OpenMPI/openmpi-1.2.8_studio32/opal/mca/maffinity/first_use'
gmake[2]: Nothing to be done for `all'.
gmake[2]: Leaving directory `/rwthfs/rz/cluster/home/pk224850/OpenMPI/openmpi-1.2.8_studio32/opal/mca/maffinity/first_use'
Making all in mca/maffinity/libnuma
gmake[2]: Entering directory `/rwthfs/rz/cluster/home/pk224850/OpenMPI/openmpi-1.2.8_studio32/opal/mca/maffinity/libnuma'
gmake[2]: Nothing to be done for `all'.
gmake[2]: Leaving directory `/rwthfs/rz/cluster/home/pk224850/OpenMPI/openmpi-1.2.8_studio32/opal/mca/maffinity/libnuma'
Making all in mca/memory/ptmalloc2
gmake[2]: Entering directory `/rwthfs/rz/cluster/home/pk224850/OpenMPI/openmpi-1.2.8_studio32/opal/mca/memory/ptmalloc2'
gmake[2]: Nothing to be done for `all'.
gmake[2]: Leaving directory `/rwthfs/rz/cluster/home/pk224850/OpenMPI/openmpi-1.2.8_studio32/opal/mca/memory/ptmalloc2'
Making all in mca/paffinity/linux
gmake[2]: Entering directory `/rwthfs/rz/cluster/home/pk224850/OpenMPI/openmpi-1.2.8_studio32/opal/mca/paffinity/linux'
gmake[2]: Nothing to be done for `all'.
gmake[2]: Leaving directory `/rwthfs/rz/cluster/home/pk224850/OpenMPI/openmpi-1.2.8_studio32/opal/mca/paffinity/linux'
Making all in mca/timer/linux
gmake[2]: Entering directory `/rwthfs/rz/cluster/home/pk224850/OpenMPI/openmpi-1.2.8_studio32/opal/mca/timer/linux'
gmake[2]: Nothing to be done for `all'.
gmake[2]: Leaving directory `/rwthfs/rz/cluster/home/pk224850/OpenMPI/openmpi-1.2.8_studio32/opal/mca/timer/linux'
Making all in .
gmake[2]: Entering directory `/rwthfs/rz/cluster/home/pk224850/OpenMPI/openmpi-1.2.8_studio32/opal'
gmake[2]: Nothing to be done for `all-am'.
gmake[2]: Leaving directory `/rwthfs/rz/cluster/home/pk224850/OpenMPI/openmpi-1.2.8_studio32/opal'
Making all in tools/wrappers
gmake[2]: Entering directory `/rwthfs/rz/cluster/home/pk224850/OpenMPI/openmpi-1.2.8_studio32/opal/tools/wrappers'
gmake[2]: Nothing to be done for `all'.
gmake[2]: Leaving directory `/rwthfs/rz/cluster/home/pk224850/OpenMPI/openmpi-1.2.8_studio32/opal/tools/wrappers'
gmake[1]: Leaving directory `/rwthfs/rz/cluster/home/pk224850/OpenMPI/openmpi-1.2.8_studio32/opal'
Making all in orte
gmake[1]: Entering directory `/rwthfs/rz/cluster/home/pk224850/OpenMPI/openmpi-1.2.8_studio32/orte'
Making all in include
gmake[2]: Entering directory `/rwthfs/rz/cluster/home/pk224850/OpenMPI/openmpi-1.2.8_studio32/orte/include'
gmake all-am
gmake[3]: Entering directory `/rwthfs/rz/cluster/home/pk224850/OpenMPI/openmpi-1.2.8_studio32/orte/include'
gmake[3]: Leaving directory `/rwthfs/rz/cluster/home/pk224850/OpenMPI/openmpi-1.2.8_studio32/orte/include'
gmake[2]: Leaving directory `/rwthfs/rz/cluster/home/pk224850/OpenMPI/openmpi-1.2.8_studio32/orte/include'
Making all in mca/errmgr
gmake[2]: Entering directory `/rwthfs/rz/cluster/home/pk224850/OpenMPI/openmpi-1.2.8_studio32/orte/mca/errmgr'
gmake[2]: Nothing to be done for `all'.
gmake[2]: Leaving directory `/rwthfs/rz/cluster/home/pk224850/OpenMPI/openmpi-1.2.8_studio32/orte/mca/errmgr'
Making all in mca/gpr
gmake[2]: Entering directory `/rwthfs/rz/cluster/home/pk224850/OpenMPI/openmpi-1.2.8_studio32/orte/mca/gpr'
gmake[2]: Nothing to be done for `all'.
gmake[2]: Leaving directory `/rwthfs/rz/cluster/home/pk224850/OpenMPI/openmpi-1.2.8_studio32/orte/mca/gpr'
Making all in mca/iof
gmake[2]: Entering directory `/rwthfs/rz/cluster/home/pk224850/OpenMPI/openmpi-1.2.8_studio32/orte/mca/iof'
gmake[2]: Nothing to be done for `all'.
gmake[2]: Leaving directory `/rwthfs/rz/cluster/home/pk224850/OpenMPI/openmpi-1.2.8_studio32/orte/mca/iof'
Making all in mca/ns
gmake[2]: Entering directory `/rwthfs/rz/cluster/home/pk224850/OpenMPI/openmpi-1.2.8_studio32/orte/mca/ns'
gmake[2]: Nothing to be done for `all'.
gmake[2]: Leaving directory `/rwthfs/rz/cluster/home/pk224850/OpenMPI/openmpi-1.2.8_studio32/orte/mca/ns'
Making all in mca/odls
gmake[2]: Entering directory `/rwthfs/rz/cluster/home/pk224850/OpenMPI/openmpi-1.2.8_studio32/orte/mca/odls'
gmake[2]: Nothing to be done for `all'.
gmake[2]: Leaving directory `/rwthfs/rz/cluster/home/pk224850/OpenMPI/openmpi-1.2.8_studio32/orte/mca/odls'
Making all in mca/oob
gmake[2]: Entering directory `/rwthfs/rz/cluster/home/pk224850/OpenMPI/openmpi-1.2.8_studio32/orte/mca/oob'
gmake[2]: Nothing to be done for `all'.
gmake[2]: Leaving directory `/rwthfs/rz/cluster/home/pk224850/OpenMPI/openmpi-1.2.8_studio32/orte/mca/oob'
Making all in mca/pls
gmake[2]: Entering directory `/rwthfs/rz/cluster/home/pk224850/OpenMPI/openmpi-1.2.8_studio32/orte/mca/pls'
gmake[2]: Nothing to be done for `all'.
gmake[2]: Leaving directory `/rwthfs/rz/cluster/home/pk224850/OpenMPI/openmpi-1.2.8_studio32/orte/mca/pls'
Making all in mca/ras
gmake[2]: Entering directory `/rwthfs/rz/cluster/home/pk224850/OpenMPI/openmpi-1.2.8_studio32/orte/mca/ras'
gmake[2]: Nothing to be done for `all'.
gmake[2]: Leaving directory `/rwthfs/rz/cluster/home/pk224850/OpenMPI/openmpi-1.2.8_studio32/orte/mca/ras'
Making all in mca/rds
gmake[2]: Entering directory `/rwthfs/rz/cluster/home/pk224850/OpenMPI/openmpi-1.2.8_studio32/orte/mca/rds'
gmake[2]: Nothing to be done for `all'.
gmake[2]: Leaving directory `/rwthfs/rz/cluster/home/pk224850/OpenMPI/openmpi-1.2.8_studio32/orte/mca/rds'
Making all in mca/rmaps
gmake[2]: Entering directory `/rwthfs/rz/cluster/home/pk224850/OpenMPI/openmpi-1.2.8_studio32/orte/mca/rmaps'
gmake[2]: Nothing to be done for `all'.
gmake[2]: Leaving directory `/rwthfs/rz/cluster/home/pk224850/OpenMPI/openmpi-1.2.8_studio32/orte/mca/rmaps'
Making all in mca/rmgr
gmake[2]: Entering directory `/rwthfs/rz/cluster/home/pk224850/OpenMPI/openmpi-1.2.8_studio32/orte/mca/rmgr'
gmake[2]: Nothing to be done for `all'.
gmake[2]: Leaving directory `/rwthfs/rz/cluster/home/pk224850/OpenMPI/openmpi-1.2.8_studio32/orte/mca/rmgr'
Making all in mca/rml
gmake[2]: Entering directory `/rwthfs/rz/cluster/home/pk224850/OpenMPI/openmpi-1.2.8_studio32/orte/mca/rml'
gmake[2]: Nothing to be done for `all'.
gmake[2]: Leaving directory `/rwthfs/rz/cluster/home/pk224850/OpenMPI/openmpi-1.2.8_studio32/orte/mca/rml'
Making all in mca/schema
gmake[2]: Entering directory `/rwthfs/rz/cluster/home/pk224850/OpenMPI/openmpi-1.2.8_studio32/orte/mca/schema'
gmake[2]: Nothing to be done for `all'.
gmake[2]: Leaving directory `/rwthfs/rz/cluster/home/pk224850/OpenMPI/openmpi-1.2.8_studio32/orte/mca/schema'
Making all in mca/sds
gmake[2]: Entering directory `/rwthfs/rz/cluster/home/pk224850/OpenMPI/openmpi-1.2.8_studio32/orte/mca/sds'
gmake[2]: Nothing to be done for `all'.
gmake[2]: Leaving directory `/rwthfs/rz/cluster/home/pk224850/OpenMPI/openmpi-1.2.8_studio32/orte/mca/sds'
Making all in mca/smr
gmake[2]: Entering directory `/rwthfs/rz/cluster/home/pk224850/OpenMPI/openmpi-1.2.8_studio32/orte/mca/smr'
gmake[2]: Nothing to be done for `all'.
gmake[2]: Leaving directory `/rwthfs/rz/cluster/home/pk224850/OpenMPI/openmpi-1.2.8_studio32/orte/mca/smr'
Making all in mca/errmgr/hnp
gmake[2]: Entering directory `/rwthfs/rz/cluster/home/pk224850/OpenMPI/openmpi-1.2.8_studio32/orte/mca/errmgr/hnp'
gmake[2]: Nothing to be done for `all'.
gmake[2]: Leaving directory `/rwthfs/rz/cluster/home/pk224850/OpenMPI/openmpi-1.2.8_studio32/orte/mca/errmgr/hnp'
Making all in mca/errmgr/orted
gmake[2]: Entering directory `/rwthfs/rz/cluster/home/pk224850/OpenMPI/openmpi-1.2.8_studio32/orte/mca/errmgr/orted'
gmake[2]: Nothing to be done for `all'.
gmake[2]: Leaving directory `/rwthfs/rz/cluster/home/pk224850/OpenMPI/openmpi-1.2.8_studio32/orte/mca/errmgr/orted'
Making all in mca/errmgr/proxy
gmake[2]: Entering directory `/rwthfs/rz/cluster/home/pk224850/OpenMPI/openmpi-1.2.8_studio32/orte/mca/errmgr/proxy'
gmake[2]: Nothing to be done for `all'.
gmake[2]: Leaving directory `/rwthfs/rz/cluster/home/pk224850/OpenMPI/openmpi-1.2.8_studio32/orte/mca/errmgr/proxy'
Making all in mca/gpr/null
gmake[2]: Entering directory `/rwthfs/rz/cluster/home/pk224850/OpenMPI/openmpi-1.2.8_studio32/orte/mca/gpr/null'
gmake[2]: Nothing to be done for `all'.
gmake[2]: Leaving directory `/rwthfs/rz/cluster/home/pk224850/OpenMPI/openmpi-1.2.8_studio32/orte/mca/gpr/null'
Making all in mca/gpr/proxy
gmake[2]: Entering directory `/rwthfs/rz/cluster/home/pk224850/OpenMPI/openmpi-1.2.8_studio32/orte/mca/gpr/proxy'
gmake[2]: Nothing to be done for `all'.
gmake[2]: Leaving directory `/rwthfs/rz/cluster/home/pk224850/OpenMPI/openmpi-1.2.8_studio32/orte/mca/gpr/proxy'
Making all in mca/gpr/replica
gmake[2]: Entering directory `/rwthfs/rz/cluster/home/pk224850/OpenMPI/openmpi-1.2.8_studio32/orte/mca/gpr/replica'
Making all in api_layer
gmake[3]: Entering directory `/rwthfs/rz/cluster/home/pk224850/OpenMPI/openmpi-1.2.8_studio32/orte/mca/gpr/replica/api_layer'
gmake[3]: Nothing to be done for `all'.
gmake[3]: Leaving directory `/rwthfs/rz/cluster/home/pk224850/OpenMPI/openmpi-1.2.8_studio32/orte/mca/gpr/replica/api_layer'
Making all in functional_layer
gmake[3]: Entering directory `/rwthfs/rz/cluster/home/pk224850/OpenMPI/openmpi-1.2.8_studio32/orte/mca/gpr/replica/functional_layer'
gmake[3]: Nothing to be done for `all'.
gmake[3]: Leaving directory `/rwthfs/rz/cluster/home/pk224850/OpenMPI/openmpi-1.2.8_studio32/orte/mca/gpr/replica/functional_layer'
Making all in transition_layer
gmake[3]: Entering directory `/rwthfs/rz/cluster/home/pk224850/OpenMPI/openmpi-1.2.8_studio32/orte/mca/gpr/replica/transition_layer'
gmake[3]: Nothing to be done for `all'.
gmake[3]: Leaving directory `/rwthfs/rz/cluster/home/pk224850/OpenMPI/openmpi-1.2.8_studio32/orte/mca/gpr/replica/transition_layer'
Making all in communications
gmake[3]: Entering directory `/rwthfs/rz/cluster/home/pk224850/OpenMPI/openmpi-1.2.8_studio32/orte/mca/gpr/replica/communications'
gmake[3]: Nothing to be done for `all'.
gmake[3]: Leaving directory `/rwthfs/rz/cluster/home/pk224850/OpenMPI/openmpi-1.2.8_studio32/orte/mca/gpr/replica/communications'
gmake[3]: Entering directory `/rwthfs/rz/cluster/home/pk224850/OpenMPI/openmpi-1.2.8_studio32/orte/mca/gpr/replica'
gmake[3]: Nothing to be done for `all-am'.
gmake[3]: Leaving directory `/rwthfs/rz/cluster/home/pk224850/OpenMPI/openmpi-1.2.8_studio32/orte/mca/gpr/replica'
gmake[2]: Leaving directory `/rwthfs/rz/cluster/home/pk224850/OpenMPI/openmpi-1.2.8_studio32/orte/mca/gpr/replica'
Making all in mca/iof/proxy
gmake[2]: Entering directory `/rwthfs/rz/cluster/home/pk224850/OpenMPI/openmpi-1.2.8_studio32/orte/mca/iof/proxy'
gmake[2]: Nothing to be done for `all'.
gmake[2]: Leaving directory `/rwthfs/rz/cluster/home/pk224850/OpenMPI/openmpi-1.2.8_studio32/orte/mca/iof/proxy'
Making all in mca/iof/svc
gmake[2]: Entering directory `/rwthfs/rz/cluster/home/pk224850/OpenMPI/openmpi-1.2.8_studio32/orte/mca/iof/svc'
gmake[2]: Nothing to be done for `all'.
gmake[2]: Leaving directory `/rwthfs/rz/cluster/home/pk224850/OpenMPI/openmpi-1.2.8_studio32/orte/mca/iof/svc'
Making all in mca/ns/proxy
gmake[2]: Entering directory `/rwthfs/rz/cluster/home/pk224850/OpenMPI/openmpi-1.2.8_studio32/orte/mca/ns/proxy'
gmake[2]: Nothing to be done for `all'.
gmake[2]: Leaving directory `/rwthfs/rz/cluster/home/pk224850/OpenMPI/openmpi-1.2.8_studio32/orte/mca/ns/proxy'
Making all in mca/ns/replica
gmake[2]: Entering directory `/rwthfs/rz/cluster/home/pk224850/OpenMPI/openmpi-1.2.8_studio32/orte/mca/ns/replica'
gmake[2]: Nothing to be done for `all'.
gmake[2]: Leaving directory `/rwthfs/rz/cluster/home/pk224850/OpenMPI/openmpi-1.2.8_studio32/orte/mca/ns/replica'
Making all in mca/odls/default
gmake[2]: Entering directory `/rwthfs/rz/cluster/home/pk224850/OpenMPI/openmpi-1.2.8_studio32/orte/mca/odls/default'
gmake[2]: Nothing to be done for `all'.
gmake[2]: Leaving directory `/rwthfs/rz/cluster/home/pk224850/OpenMPI/openmpi-1.2.8_studio32/orte/mca/odls/default'
Making all in mca/oob/tcp
gmake[2]: Entering directory `/rwthfs/rz/cluster/home/pk224850/OpenMPI/openmpi-1.2.8_studio32/orte/mca/oob/tcp'
gmake[2]: Nothing to be done for `all'.
gmake[2]: Leaving directory `/rwthfs/rz/cluster/home/pk224850/OpenMPI/openmpi-1.2.8_studio32/orte/mca/oob/tcp'
Making all in mca/pls/proxy
gmake[2]: Entering directory `/rwthfs/rz/cluster/home/pk224850/OpenMPI/openmpi-1.2.8_studio32/orte/mca/pls/proxy'
gmake[2]: Nothing to be done for `all'.
gmake[2]: Leaving directory `/rwthfs/rz/cluster/home/pk224850/OpenMPI/openmpi-1.2.8_studio32/orte/mca/pls/proxy'
Making all in mca/pls/gridengine
gmake[2]: Entering directory `/rwthfs/rz/cluster/home/pk224850/OpenMPI/openmpi-1.2.8_studio32/orte/mca/pls/gridengine'
gmake[2]: Nothing to be done for `all'.
gmake[2]: Leaving directory `/rwthfs/rz/cluster/home/pk224850/OpenMPI/openmpi-1.2.8_studio32/orte/mca/pls/gridengine'
Making all in mca/pls/rsh
gmake[2]: Entering directory `/rwthfs/rz/cluster/home/pk224850/OpenMPI/openmpi-1.2.8_studio32/orte/mca/pls/rsh'
gmake[2]: Nothing to be done for `all'.
gmake[2]: Leaving directory `/rwthfs/rz/cluster/home/pk224850/OpenMPI/openmpi-1.2.8_studio32/orte/mca/pls/rsh'
Making all in mca/pls/slurm
gmake[2]: Entering directory `/rwthfs/rz/cluster/home/pk224850/OpenMPI/openmpi-1.2.8_studio32/orte/mca/pls/slurm'
gmake[2]: Nothing to be done for `all'.
gmake[2]: Leaving directory `/rwthfs/rz/cluster/home/pk224850/OpenMPI/openmpi-1.2.8_studio32/orte/mca/pls/slurm'
Making all in mca/ras/dash_host
gmake[2]: Entering directory `/rwthfs/rz/cluster/home/pk224850/OpenMPI/openmpi-1.2.8_studio32/orte/mca/ras/dash_host'
gmake[2]: Nothing to be done for `all'.
gmake[2]: Leaving directory `/rwthfs/rz/cluster/home/pk224850/OpenMPI/openmpi-1.2.8_studio32/orte/mca/ras/dash_host'
Making all in mca/ras/localhost
gmake[2]: Entering directory `/rwthfs/rz/cluster/home/pk224850/OpenMPI/openmpi-1.2.8_studio32/orte/mca/ras/localhost'
gmake[2]: Nothing to be done for `all'.
gmake[2]: Leaving directory `/rwthfs/rz/cluster/home/pk224850/OpenMPI/openmpi-1.2.8_studio32/orte/mca/ras/localhost'
Making all in mca/ras/gridengine
gmake[2]: Entering directory `/rwthfs/rz/cluster/home/pk224850/OpenMPI/openmpi-1.2.8_studio32/orte/mca/ras/gridengine'
gmake[2]: Nothing to be done for `all'.
gmake[2]: Leaving directory `/rwthfs/rz/cluster/home/pk224850/OpenMPI/openmpi-1.2.8_studio32/orte/mca/ras/gridengine'
Making all in mca/ras/slurm
gmake[2]: Entering directory `/rwthfs/rz/cluster/home/pk224850/OpenMPI/openmpi-1.2.8_studio32/orte/mca/ras/slurm'
gmake[2]: Nothing to be done for `all'.
gmake[2]: Leaving directory `/rwthfs/rz/cluster/home/pk224850/OpenMPI/openmpi-1.2.8_studio32/orte/mca/ras/slurm'
Making all in mca/rds/hostfile
gmake[2]: Entering directory `/rwthfs/rz/cluster/home/pk224850/OpenMPI/openmpi-1.2.8_studio32/orte/mca/rds/hostfile'
gmake[2]: Nothing to be done for `all'.
gmake[2]: Leaving directory `/rwthfs/rz/cluster/home/pk224850/OpenMPI/openmpi-1.2.8_studio32/orte/mca/rds/hostfile'
Making all in mca/rds/proxy
gmake[2]: Entering directory `/rwthfs/rz/cluster/home/pk224850/OpenMPI/openmpi-1.2.8_studio32/orte/mca/rds/proxy'
gmake[2]: Nothing to be done for `all'.
gmake[2]: Leaving directory `/rwthfs/rz/cluster/home/pk224850/OpenMPI/openmpi-1.2.8_studio32/orte/mca/rds/proxy'
Making all in mca/rds/resfile
gmake[2]: Entering directory `/rwthfs/rz/cluster/home/pk224850/OpenMPI/openmpi-1.2.8_studio32/orte/mca/rds/resfile'
gmake[2]: Nothing to be done for `all'.
gmake[2]: Leaving directory `/rwthfs/rz/cluster/home/pk224850/OpenMPI/openmpi-1.2.8_studio32/orte/mca/rds/resfile'
Making all in mca/rmaps/round_robin
gmake[2]: Entering directory `/rwthfs/rz/cluster/home/pk224850/OpenMPI/openmpi-1.2.8_studio32/orte/mca/rmaps/round_robin'
gmake[2]: Nothing to be done for `all'.
gmake[2]: Leaving directory `/rwthfs/rz/cluster/home/pk224850/OpenMPI/openmpi-1.2.8_studio32/orte/mca/rmaps/round_robin'
Making all in mca/rmgr/proxy
gmake[2]: Entering directory `/rwthfs/rz/cluster/home/pk224850/OpenMPI/openmpi-1.2.8_studio32/orte/mca/rmgr/proxy'
gmake[2]: Nothing to be done for `all'.
gmake[2]: Leaving directory `/rwthfs/rz/cluster/home/pk224850/OpenMPI/openmpi-1.2.8_studio32/orte/mca/rmgr/proxy'
Making all in mca/rmgr/urm
gmake[2]: Entering directory `/rwthfs/rz/cluster/home/pk224850/OpenMPI/openmpi-1.2.8_studio32/orte/mca/rmgr/urm'
gmake[2]: Nothing to be done for `all'.
gmake[2]: Leaving directory `/rwthfs/rz/cluster/home/pk224850/OpenMPI/openmpi-1.2.8_studio32/orte/mca/rmgr/urm'
Making all in mca/rml/oob
gmake[2]: Entering directory `/rwthfs/rz/cluster/home/pk224850/OpenMPI/openmpi-1.2.8_studio32/orte/mca/rml/oob'
gmake[2]: Nothing to be done for `all'.
gmake[2]: Leaving directory `/rwthfs/rz/cluster/home/pk224850/OpenMPI/openmpi-1.2.8_studio32/orte/mca/rml/oob'
Making all in mca/sds/env
gmake[2]: Entering directory `/rwthfs/rz/cluster/home/pk224850/OpenMPI/openmpi-1.2.8_studio32/orte/mca/sds/env'
gmake[2]: Nothing to be done for `all'.
gmake[2]: Leaving directory `/rwthfs/rz/cluster/home/pk224850/OpenMPI/openmpi-1.2.8_studio32/orte/mca/sds/env'
Making all in mca/sds/seed
gmake[2]: Entering directory `/rwthfs/rz/cluster/home/pk224850/OpenMPI/openmpi-1.2.8_studio32/orte/mca/sds/seed'
gmake[2]: Nothing to be done for `all'.
gmake[2]: Leaving directory `/rwthfs/rz/cluster/home/pk224850/OpenMPI/openmpi-1.2.8_studio32/orte/mca/sds/seed'
Making all in mca/sds/singleton
gmake[2]: Entering directory `/rwthfs/rz/cluster/home/pk224850/OpenMPI/openmpi-1.2.8_studio32/orte/mca/sds/singleton'
gmake[2]: Nothing to be done for `all'.
gmake[2]: Leaving directory `/rwthfs/rz/cluster/home/pk224850/OpenMPI/openmpi-1.2.8_studio32/orte/mca/sds/singleton'
Making all in mca/sds/pipe
gmake[2]: Entering directory `/rwthfs/rz/cluster/home/pk224850/OpenMPI/openmpi-1.2.8_studio32/orte/mca/sds/pipe'
gmake[2]: Nothing to be done for `all'.
gmake[2]: Leaving directory `/rwthfs/rz/cluster/home/pk224850/OpenMPI/openmpi-1.2.8_studio32/orte/mca/sds/pipe'
Making all in mca/sds/slurm
gmake[2]: Entering directory `/rwthfs/rz/cluster/home/pk224850/OpenMPI/openmpi-1.2.8_studio32/orte/mca/sds/slurm'
gmake[2]: Nothing to be done for `all'.
gmake[2]: Leaving directory `/rwthfs/rz/cluster/home/pk224850/OpenMPI/openmpi-1.2.8_studio32/orte/mca/sds/slurm'
Making all in etc
gmake[2]: Entering directory `/rwthfs/rz/cluster/home/pk224850/OpenMPI/openmpi-1.2.8_studio32/orte/etc'
gmake[2]: Nothing to be done for `all'.
gmake[2]: Leaving directory `/rwthfs/rz/cluster/home/pk224850/OpenMPI/openmpi-1.2.8_studio32/orte/etc'
Making all in .
gmake[2]: Entering directory `/rwthfs/rz/cluster/home/pk224850/OpenMPI/openmpi-1.2.8_studio32/orte'
gmake[2]: Nothing to be done for `all-am'.
gmake[2]: Leaving directory `/rwthfs/rz/cluster/home/pk224850/OpenMPI/openmpi-1.2.8_studio32/orte'
Making all in tools/orted
gmake[2]: Entering directory `/rwthfs/rz/cluster/home/pk224850/OpenMPI/openmpi-1.2.8_studio32/orte/tools/orted'
gmake[2]: Nothing to be done for `all'.
gmake[2]: Leaving directory `/rwthfs/rz/cluster/home/pk224850/OpenMPI/openmpi-1.2.8_studio32/orte/tools/orted'
Making all in tools/orterun
gmake[2]: Entering directory `/rwthfs/rz/cluster/home/pk224850/OpenMPI/openmpi-1.2.8_studio32/orte/tools/orterun'
gmake[2]: Nothing to be done for `all'.
gmake[2]: Leaving directory `/rwthfs/rz/cluster/home/pk224850/OpenMPI/openmpi-1.2.8_studio32/orte/tools/orterun'
Making all in tools/wrappers
gmake[2]: Entering directory `/rwthfs/rz/cluster/home/pk224850/OpenMPI/openmpi-1.2.8_studio32/orte/tools/wrappers'
gmake[2]: Nothing to be done for `all'.
gmake[2]: Leaving directory `/rwthfs/rz/cluster/home/pk224850/OpenMPI/openmpi-1.2.8_studio32/orte/tools/wrappers'
gmake[1]: Leaving directory `/rwthfs/rz/cluster/home/pk224850/OpenMPI/openmpi-1.2.8_studio32/orte'
Making all in ompi
gmake[1]: Entering directory `/rwthfs/rz/cluster/home/pk224850/OpenMPI/openmpi-1.2.8_studio32/ompi'
Making all in include
gmake[2]: Entering directory `/rwthfs/rz/cluster/home/pk224850/OpenMPI/openmpi-1.2.8_studio32/ompi/include'
gmake all-am
gmake[3]: Entering directory `/rwthfs/rz/cluster/home/pk224850/OpenMPI/openmpi-1.2.8_studio32/ompi/include'
gmake[3]: Leaving directory `/rwthfs/rz/cluster/home/pk224850/OpenMPI/openmpi-1.2.8_studio32/ompi/include'
gmake[2]: Leaving directory `/rwthfs/rz/cluster/home/pk224850/OpenMPI/openmpi-1.2.8_studio32/ompi/include'
Making all in datatype
gmake[2]: Entering directory `/rwthfs/rz/cluster/home/pk224850/OpenMPI/openmpi-1.2.8_studio32/ompi/datatype'
gmake[2]: Nothing to be done for `all'.
gmake[2]: Leaving directory `/rwthfs/rz/cluster/home/pk224850/OpenMPI/openmpi-1.2.8_studio32/ompi/datatype'
Making all in debuggers
gmake[2]: Entering directory `/rwthfs/rz/cluster/home/pk224850/OpenMPI/openmpi-1.2.8_studio32/ompi/debuggers'
gmake[2]: Nothing to be done for `all'.
gmake[2]: Leaving directory `/rwthfs/rz/cluster/home/pk224850/OpenMPI/openmpi-1.2.8_studio32/ompi/debuggers'
Making all in etc
gmake[2]: Entering directory `/rwthfs/rz/cluster/home/pk224850/OpenMPI/openmpi-1.2.8_studio32/ompi/etc'
gmake[2]: Nothing to be done for `all'.
gmake[2]: Leaving directory `/rwthfs/rz/cluster/home/pk224850/OpenMPI/openmpi-1.2.8_studio32/ompi/etc'
Making all in mpi
gmake[2]: Entering directory `/rwthfs/rz/cluster/home/pk224850/OpenMPI/openmpi-1.2.8_studio32/ompi/mpi'
Making all in c
gmake[3]: Entering directory `/rwthfs/rz/cluster/home/pk224850/OpenMPI/openmpi-1.2.8_studio32/ompi/mpi/c'
Making all in profile
gmake[4]: Entering directory `/rwthfs/rz/cluster/home/pk224850/OpenMPI/openmpi-1.2.8_studio32/ompi/mpi/c/profile'
gmake[4]: Nothing to be done for `all'.
gmake[4]: Leaving directory `/rwthfs/rz/cluster/home/pk224850/OpenMPI/openmpi-1.2.8_studio32/ompi/mpi/c/profile'
gmake[4]: Entering directory `/rwthfs/rz/cluster/home/pk224850/OpenMPI/openmpi-1.2.8_studio32/ompi/mpi/c'
gmake[4]: Nothing to be done for `all-am'.
gmake[4]: Leaving directory `/rwthfs/rz/cluster/home/pk224850/OpenMPI/openmpi-1.2.8_studio32/ompi/mpi/c'
gmake[3]: Leaving directory `/rwthfs/rz/cluster/home/pk224850/OpenMPI/openmpi-1.2.8_studio32/ompi/mpi/c'
Making all in cxx
gmake[3]: Entering directory `/rwthfs/rz/cluster/home/pk224850/OpenMPI/openmpi-1.2.8_studio32/ompi/mpi/cxx'
gmake[3]: Nothing to be done for `all'.
gmake[3]: Leaving directory `/rwthfs/rz/cluster/home/pk224850/OpenMPI/openmpi-1.2.8_studio32/ompi/mpi/cxx'
Making all in f77
gmake[3]: Entering directory `/rwthfs/rz/cluster/home/pk224850/OpenMPI/openmpi-1.2.8_studio32/ompi/mpi/f77'
Making all in profile
gmake[4]: Entering directory `/rwthfs/rz/cluster/home/pk224850/OpenMPI/openmpi-1.2.8_studio32/ompi/mpi/f77/profile'
gmake[4]: Nothing to be done for `all'.
gmake[4]: Leaving directory `/rwthfs/rz/cluster/home/pk224850/OpenMPI/openmpi-1.2.8_studio32/ompi/mpi/f77/profile'
gmake[4]: Entering directory `/rwthfs/rz/cluster/home/pk224850/OpenMPI/openmpi-1.2.8_studio32/ompi/mpi/f77'
gmake[4]: Nothing to be done for `all-am'.
gmake[4]: Leaving directory `/rwthfs/rz/cluster/home/pk224850/OpenMPI/openmpi-1.2.8_studio32/ompi/mpi/f77'
gmake[3]: Leaving directory `/rwthfs/rz/cluster/home/pk224850/OpenMPI/openmpi-1.2.8_studio32/ompi/mpi/f77'
Making all in f90
gmake[3]: Entering directory `/rwthfs/rz/cluster/home/pk224850/OpenMPI/openmpi-1.2.8_studio32/ompi/mpi/f90'
gmake all-recursive
gmake[4]: Entering directory `/rwthfs/rz/cluster/home/pk224850/OpenMPI/openmpi-1.2.8_studio32/ompi/mpi/f90'
Making all in scripts
gmake[5]: Entering directory `/rwthfs/rz/cluster/home/pk224850/OpenMPI/openmpi-1.2.8_studio32/ompi/mpi/f90/scripts'
gmake[5]: Nothing to be done for `all'.
gmake[5]: Leaving directory `/rwthfs/rz/cluster/home/pk224850/OpenMPI/openmpi-1.2.8_studio32/ompi/mpi/f90/scripts'
gmake[5]: Entering directory `/rwthfs/rz/cluster/home/pk224850/OpenMPI/openmpi-1.2.8_studio32/ompi/mpi/f90'
gmake[5]: Nothing to be done for `all-am'.
gmake[5]: Leaving directory `/rwthfs/rz/cluster/home/pk224850/OpenMPI/openmpi-1.2.8_studio32/ompi/mpi/f90'
gmake[4]: Leaving directory `/rwthfs/rz/cluster/home/pk224850/OpenMPI/openmpi-1.2.8_studio32/ompi/mpi/f90'
gmake[3]: Leaving directory `/rwthfs/rz/cluster/home/pk224850/OpenMPI/openmpi-1.2.8_studio32/ompi/mpi/f90'
gmake[3]: Entering directory `/rwthfs/rz/cluster/home/pk224850/OpenMPI/openmpi-1.2.8_studio32/ompi/mpi'
gmake[3]: Nothing to be done for `all-am'.
gmake[3]: Leaving directory `/rwthfs/rz/cluster/home/pk224850/OpenMPI/openmpi-1.2.8_studio32/ompi/mpi'
gmake[2]: Leaving directory `/rwthfs/rz/cluster/home/pk224850/OpenMPI/openmpi-1.2.8_studio32/ompi/mpi'
Making all in mca/common
gmake[2]: Entering directory `/rwthfs/rz/cluster/home/pk224850/OpenMPI/openmpi-1.2.8_studio32/ompi/mca/common'
gmake[2]: Nothing to be done for `all'.
gmake[2]: Leaving directory `/rwthfs/rz/cluster/home/pk224850/OpenMPI/openmpi-1.2.8_studio32/ompi/mca/common'
Making all in mca/allocator
gmake[2]: Entering directory `/rwthfs/rz/cluster/home/pk224850/OpenMPI/openmpi-1.2.8_studio32/ompi/mca/allocator'
gmake[2]: Nothing to be done for `all'.
gmake[2]: Leaving directory `/rwthfs/rz/cluster/home/pk224850/OpenMPI/openmpi-1.2.8_studio32/ompi/mca/allocator'
Making all in mca/bml
gmake[2]: Entering directory `/rwthfs/rz/cluster/home/pk224850/OpenMPI/openmpi-1.2.8_studio32/ompi/mca/bml'
gmake[2]: Nothing to be done for `all'.
gmake[2]: Leaving directory `/rwthfs/rz/cluster/home/pk224850/OpenMPI/openmpi-1.2.8_studio32/ompi/mca/bml'
Making all in mca/btl
gmake[2]: Entering directory `/rwthfs/rz/cluster/home/pk224850/OpenMPI/openmpi-1.2.8_studio32/ompi/mca/btl'
gmake[2]: Nothing to be done for `all'.
gmake[2]: Leaving directory `/rwthfs/rz/cluster/home/pk224850/OpenMPI/openmpi-1.2.8_studio32/ompi/mca/btl'
Making all in mca/coll
gmake[2]: Entering directory `/rwthfs/rz/cluster/home/pk224850/OpenMPI/openmpi-1.2.8_studio32/ompi/mca/coll'
gmake[2]: Nothing to be done for `all'.
gmake[2]: Leaving directory `/rwthfs/rz/cluster/home/pk224850/OpenMPI/openmpi-1.2.8_studio32/ompi/mca/coll'
Making all in mca/io
gmake[2]: Entering directory `/rwthfs/rz/cluster/home/pk224850/OpenMPI/openmpi-1.2.8_studio32/ompi/mca/io'
gmake[2]: Nothing to be done for `all'.
gmake[2]: Leaving directory `/rwthfs/rz/cluster/home/pk224850/OpenMPI/openmpi-1.2.8_studio32/ompi/mca/io'
Making all in mca/mpool
gmake[2]: Entering directory `/rwthfs/rz/cluster/home/pk224850/OpenMPI/openmpi-1.2.8_studio32/ompi/mca/mpool'
gmake[2]: Nothing to be done for `all'.
gmake[2]: Leaving directory `/rwthfs/rz/cluster/home/pk224850/OpenMPI/openmpi-1.2.8_studio32/ompi/mca/mpool'
Making all in mca/mtl
gmake[2]: Entering directory `/rwthfs/rz/cluster/home/pk224850/OpenMPI/openmpi-1.2.8_studio32/ompi/mca/mtl'
gmake[2]: Nothing to be done for `all'.
gmake[2]: Leaving directory `/rwthfs/rz/cluster/home/pk224850/OpenMPI/openmpi-1.2.8_studio32/ompi/mca/mtl'
Making all in mca/osc
gmake[2]: Entering directory `/rwthfs/rz/cluster/home/pk224850/OpenMPI/openmpi-1.2.8_studio32/ompi/mca/osc'
gmake[2]: Nothing to be done for `all'.
gmake[2]: Leaving directory `/rwthfs/rz/cluster/home/pk224850/OpenMPI/openmpi-1.2.8_studio32/ompi/mca/osc'
Making all in mca/pml
gmake[2]: Entering directory `/rwthfs/rz/cluster/home/pk224850/OpenMPI/openmpi-1.2.8_studio32/ompi/mca/pml'
gmake[2]: Nothing to be done for `all'.
gmake[2]: Leaving directory `/rwthfs/rz/cluster/home/pk224850/OpenMPI/openmpi-1.2.8_studio32/ompi/mca/pml'
Making all in mca/rcache
gmake[2]: Entering directory `/rwthfs/rz/cluster/home/pk224850/OpenMPI/openmpi-1.2.8_studio32/ompi/mca/rcache'
gmake[2]: Nothing to be done for `all'.
gmake[2]: Leaving directory `/rwthfs/rz/cluster/home/pk224850/OpenMPI/openmpi-1.2.8_studio32/ompi/mca/rcache'
Making all in mca/topo
gmake[2]: Entering directory `/rwthfs/rz/cluster/home/pk224850/OpenMPI/openmpi-1.2.8_studio32/ompi/mca/topo'
gmake[2]: Nothing to be done for `all'.
gmake[2]: Leaving directory `/rwthfs/rz/cluster/home/pk224850/OpenMPI/openmpi-1.2.8_studio32/ompi/mca/topo'
Making all in mca/common/sm
gmake[2]: Entering directory `/rwthfs/rz/cluster/home/pk224850/OpenMPI/openmpi-1.2.8_studio32/ompi/mca/common/sm'
if test -z ""; then \
          rm -f "libmca_common_sm.la"; \
          ln -s "libmca_common_sm_noinst.la" "libmca_common_sm.la"; \
        fi
gmake[2]: Leaving directory `/rwthfs/rz/cluster/home/pk224850/OpenMPI/openmpi-1.2.8_studio32/ompi/mca/common/sm'
Making all in mca/allocator/basic
gmake[2]: Entering directory `/rwthfs/rz/cluster/home/pk224850/OpenMPI/openmpi-1.2.8_studio32/ompi/mca/allocator/basic'
gmake[2]: Nothing to be done for `all'.
gmake[2]: Leaving directory `/rwthfs/rz/cluster/home/pk224850/OpenMPI/openmpi-1.2.8_studio32/ompi/mca/allocator/basic'
Making all in mca/allocator/bucket
gmake[2]: Entering directory `/rwthfs/rz/cluster/home/pk224850/OpenMPI/openmpi-1.2.8_studio32/ompi/mca/allocator/bucket'
gmake[2]: Nothing to be done for `all'.
gmake[2]: Leaving directory `/rwthfs/rz/cluster/home/pk224850/OpenMPI/openmpi-1.2.8_studio32/ompi/mca/allocator/bucket'
Making all in mca/bml/r2
gmake[2]: Entering directory `/rwthfs/rz/cluster/home/pk224850/OpenMPI/openmpi-1.2.8_studio32/ompi/mca/bml/r2'
gmake[2]: Nothing to be done for `all'.
gmake[2]: Leaving directory `/rwthfs/rz/cluster/home/pk224850/OpenMPI/openmpi-1.2.8_studio32/ompi/mca/bml/r2'
Making all in mca/btl/self
gmake[2]: Entering directory `/rwthfs/rz/cluster/home/pk224850/OpenMPI/openmpi-1.2.8_studio32/ompi/mca/btl/self'
gmake[2]: Nothing to be done for `all'.
gmake[2]: Leaving directory `/rwthfs/rz/cluster/home/pk224850/OpenMPI/openmpi-1.2.8_studio32/ompi/mca/btl/self'
Making all in mca/btl/sm
gmake[2]: Entering directory `/rwthfs/rz/cluster/home/pk224850/OpenMPI/openmpi-1.2.8_studio32/ompi/mca/btl/sm'
gmake[2]: Nothing to be done for `all'.
gmake[2]: Leaving directory `/rwthfs/rz/cluster/home/pk224850/OpenMPI/openmpi-1.2.8_studio32/ompi/mca/btl/sm'
Making all in mca/btl/openib
gmake[2]: Entering directory `/rwthfs/rz/cluster/home/pk224850/OpenMPI/openmpi-1.2.8_studio32/ompi/mca/btl/openib'
source='btl_openib_component.c' object='btl_openib_component.lo' libtool=yes \
        DEPDIR=.deps depmode=none /bin/sh ../../../../config/depcomp \
        /bin/sh ../../../../libtool --tag=CC --mode=compile cc -DHAVE_CONFIG_H -I. -I../../../../opal/include -I../../../../orte/include -I../../../../ompi/include -DPKGDATADIR=\"/rwthfs/rz/SW/MPI/openmpi-1.2.8/linux32/studio/share/openmpi\" -I../../../.. -DNDEBUG -O2 -m32 -c -o btl_openib_component.lo btl_openib_component.c
libtool: compile: cc -DHAVE_CONFIG_H -I. -I../../../../opal/include -I../../../../orte/include -I../../../../ompi/include -DPKGDATADIR=\"/rwthfs/rz/SW/MPI/openmpi-1.2.8/linux32/studio/share/openmpi\" -I../../../.. -DNDEBUG -O2 -m32 -c btl_openib_component.c -KPIC -DPIC -o .libs/btl_openib_component.o
"../../../../opal/include/opal/sys/ia32/atomic.h", line 167: warning: impossible constraint for "%1" asm operand
"../../../../opal/include/opal/sys/ia32/atomic.h", line 167: warning: parameter in inline asm statement unused: %2
"../../../../opal/include/opal/sys/ia32/atomic.h", line 184: warning: impossible constraint for "%1" asm operand
"../../../../opal/include/opal/sys/ia32/atomic.h", line 184: warning: parameter in inline asm statement unused: %2
"/usr/include/infiniband/kern-abi.h", line 103: syntax error before or at: __u64
"/usr/include/infiniband/kern-abi.h", line 109: syntax error before or at: __u64
"/usr/include/infiniband/kern-abi.h", line 124: syntax error before or at: __u64
"/usr/include/infiniband/kern-abi.h", line 135: syntax error before or at: __u64
"/usr/include/infiniband/kern-abi.h", line 148: syntax error before or at: __u64
"/usr/include/infiniband/kern-abi.h", line 153: syntax error before or at: __u64
"/usr/include/infiniband/kern-abi.h", line 200: syntax error before or at: __u64
"/usr/include/infiniband/kern-abi.h", line 203: syntax error before or at: __u64
"/usr/include/infiniband/kern-abi.h", line 233: syntax error before or at: __u64
"/usr/include/infiniband/kern-abi.h", line 252: syntax error before or at: __u64
"/usr/include/infiniband/kern-abi.h", line 258: syntax error before or at: __u64
"/usr/include/infiniband/kern-abi.h", line 278: syntax error before or at: __u64
"/usr/include/infiniband/kern-abi.h", line 289: syntax error before or at: __u64
"/usr/include/infiniband/kern-abi.h", line 295: syntax error before or at: __u64
"/usr/include/infiniband/kern-abi.h", line 304: syntax error before or at: __u64
"/usr/include/infiniband/kern-abi.h", line 325: syntax error before or at: __u64
"/usr/include/infiniband/kern-abi.h", line 348: syntax error before or at: __u64
"/usr/include/infiniband/kern-abi.h", line 351: syntax error before or at: __u64
"/usr/include/infiniband/kern-abi.h", line 357: syntax error before or at: __u64
"/usr/include/infiniband/kern-abi.h", line 364: syntax error before or at: __u64
"/usr/include/infiniband/kern-abi.h", line 436: syntax error before or at: __u64
"/usr/include/infiniband/kern-abi.h", line 451: syntax error before or at: __u64
"/usr/include/infiniband/kern-abi.h", line 484: syntax error before or at: __u64
"/usr/include/infiniband/kern-abi.h", line 487: syntax error before or at: __u64
"/usr/include/infiniband/kern-abi.h", line 521: syntax error before or at: __u64
"/usr/include/infiniband/kern-abi.h", line 554: syntax error before or at: __u64
"/usr/include/infiniband/kern-abi.h", line 561: syntax error before or at: __u64
"/usr/include/infiniband/kern-abi.h", line 571: syntax error before or at: __u64
"/usr/include/infiniband/kern-abi.h", line 578: syntax error before or at: __u64
"/usr/include/infiniband/kern-abi.h", line 583: syntax error before or at: __u64
"/usr/include/infiniband/kern-abi.h", line 602: syntax error before or at: __u64
"/usr/include/infiniband/kern-abi.h", line 615: syntax error before or at: __u64
"/usr/include/infiniband/kern-abi.h", line 624: syntax error before or at: __u64
"/usr/include/infiniband/kern-abi.h", line 640: syntax error before or at: __u64
"/usr/include/infiniband/kern-abi.h", line 656: syntax error before or at: __u64
"/usr/include/infiniband/kern-abi.h", line 682: syntax error before or at: __u64
"/usr/include/infiniband/kern-abi.h", line 693: syntax error before or at: __u64
"/usr/include/infiniband/kern-abi.h", line 700: syntax error before or at: __u64
"/usr/include/infiniband/kern-abi.h", line 706: syntax error before or at: __u64
"/usr/include/infiniband/kern-abi.h", line 724: syntax error before or at: __u64
"/usr/include/infiniband/kern-abi.h", line 731: syntax error before or at: __u64
"/usr/include/infiniband/kern-abi.h", line 734: syntax error before or at: __u64
"/usr/include/infiniband/kern-abi.h", line 748: syntax error before or at: __u64
"/usr/include/infiniband/kern-abi.h", line 833: syntax error before or at: __u64
"/usr/include/infiniband/kern-abi.h", line 842: syntax error before or at: __u64
"/usr/include/infiniband/kern-abi.h", line 846: syntax error before or at: __u64
"/usr/include/infiniband/kern-abi.h", line 859: syntax error before or at: __u64
"/usr/include/infiniband/driver.h", line 56: syntax error before or at: typedef
"/usr/include/infiniband/driver.h", line 59: syntax error before or at: ibv_driver_init_func
"/usr/include/infiniband/driver.h", line 59: member cannot be function: ibv_register_driver
"/usr/include/infiniband/driver.h", line 60: member cannot be function: ibv_cmd_get_context
"/usr/include/infiniband/driver.h", line 63: member cannot be function: ibv_cmd_query_device
"/usr/include/infiniband/driver.h", line 67: member cannot be function: ibv_cmd_query_port
"/usr/include/infiniband/driver.h", line 70: member cannot be function: ibv_cmd_query_gid
"/usr/include/infiniband/driver.h", line 72: member cannot be function: ibv_cmd_query_pkey
"/usr/include/infiniband/driver.h", line 74: member cannot be function: ibv_cmd_alloc_pd
"/usr/include/infiniband/driver.h", line 77: member cannot be function: ibv_cmd_dealloc_pd
"/usr/include/infiniband/driver.h", line 79: member cannot be function: ibv_cmd_reg_mr
"/usr/include/infiniband/driver.h", line 84: member cannot be function: ibv_cmd_dereg_mr
"/usr/include/infiniband/driver.h", line 85: member cannot be function: ibv_cmd_create_cq
"/usr/include/infiniband/driver.h", line 90: member cannot be function: ibv_cmd_poll_cq
"/usr/include/infiniband/driver.h", line 91: member cannot be function: ibv_cmd_req_notify_cq
"/usr/include/infiniband/driver.h", line 93: member cannot be function: ibv_cmd_resize_cq
"/usr/include/infiniband/driver.h", line 96: member cannot be function: ibv_cmd_destroy_cq
"/usr/include/infiniband/driver.h", line 98: member cannot be function: ibv_cmd_create_srq
"/usr/include/infiniband/driver.h", line 102: member cannot be function: ibv_cmd_modify_srq
"/usr/include/infiniband/driver.h", line 106: member cannot be function: ibv_cmd_query_srq
"/usr/include/infiniband/driver.h", line 109: member cannot be function: ibv_cmd_destroy_srq
"/usr/include/infiniband/driver.h", line 111: member cannot be function: ibv_cmd_create_qp
"/usr/include/infiniband/driver.h", line 115: member cannot be function: ibv_cmd_query_qp
"/usr/include/infiniband/driver.h", line 119: member cannot be function: ibv_cmd_modify_qp
"/usr/include/infiniband/driver.h", line 122: member cannot be function: ibv_cmd_destroy_qp
"/usr/include/infiniband/driver.h", line 123: member cannot be function: ibv_cmd_post_send
"/usr/include/infiniband/driver.h", line 125: member cannot be function: ibv_cmd_post_recv
"/usr/include/infiniband/driver.h", line 127: member cannot be function: ibv_cmd_post_srq_recv
"/usr/include/infiniband/driver.h", line 129: member cannot be function: ibv_cmd_create_ah
"/usr/include/infiniband/driver.h", line 131: member cannot be function: ibv_cmd_destroy_ah
"/usr/include/infiniband/driver.h", line 132: member cannot be function: ibv_cmd_attach_mcast
"/usr/include/infiniband/driver.h", line 133: member cannot be function: ibv_cmd_detach_mcast
"/usr/include/infiniband/driver.h", line 135: member cannot be function: ibv_dontfork_range
"/usr/include/infiniband/driver.h", line 136: member cannot be function: ibv_dofork_range
"/usr/include/infiniband/driver.h", line 141: member cannot be function: ibv_get_sysfs_path
"/usr/include/infiniband/driver.h", line 143: member cannot be function: ibv_read_sysfs_file
"/usr/include/sys/stat.h", line 207: syntax error before or at: extern
"/usr/include/sys/stat.h", line 207: member cannot be function: stat
"/usr/include/sys/stat.h", line 212: syntax error before or at: extern
"/usr/include/sys/stat.h", line 212: member cannot be function: fstat
"/usr/include/sys/stat.h", line 226: syntax error before or at: extern
"/usr/include/sys/stat.h", line 226: member cannot be function: stat64
"/usr/include/sys/stat.h", line 228: syntax error before or at: extern
"/usr/include/sys/stat.h", line 228: member cannot be function: fstat64
"/usr/include/sys/stat.h", line 236: syntax error before or at: extern
"/usr/include/sys/stat.h", line 236: member cannot be function: fstatat
"/usr/include/sys/stat.h", line 250: syntax error before or at: extern
"/usr/include/sys/stat.h", line 250: member cannot be function: fstatat64
"/usr/include/sys/stat.h", line 259: syntax error before or at: extern
"/usr/include/sys/stat.h", line 259: member cannot be function: lstat
"/usr/include/sys/stat.h", line 272: syntax error before or at: extern
"/usr/include/sys/stat.h", line 272: member cannot be function: lstat64
"/usr/include/sys/stat.h", line 280: syntax error before or at: extern
"/usr/include/sys/stat.h", line 280: member cannot be function: chmod
"/usr/include/sys/stat.h", line 287: syntax error before or at: extern
"/usr/include/sys/stat.h", line 287: member cannot be function: lchmod
"/usr/include/sys/stat.h", line 293: syntax error before or at: extern
"/usr/include/sys/stat.h", line 293: member cannot be function: fchmod
"/usr/include/sys/stat.h", line 299: syntax error before or at: extern
"/usr/include/sys/stat.h", line 299: member cannot be function: fchmodat
"/usr/include/sys/stat.h", line 307: syntax error before or at: extern
"/usr/include/sys/stat.h", line 307: member cannot be function: umask
"/usr/include/sys/stat.h", line 312: syntax error before or at: extern
"/usr/include/sys/stat.h", line 312: member cannot be function: getumask
"/usr/include/sys/stat.h", line 316: syntax error before or at: extern
"/usr/include/sys/stat.h", line 316: member cannot be function: mkdir
"/usr/include/sys/stat.h", line 323: syntax error before or at: extern
"/usr/include/sys/stat.h", line 323: member cannot be function: mkdirat
"/usr/include/sys/stat.h", line 331: syntax error before or at: extern
"/usr/include/sys/stat.h", line 331: member cannot be function: mknod
"/usr/include/sys/stat.h", line 339: syntax error before or at: extern
"/usr/include/sys/stat.h", line 339: member cannot be function: mknodat
"/usr/include/sys/stat.h", line 345: syntax error before or at: extern
"/usr/include/sys/stat.h", line 345: member cannot be function: mkfifo
"/usr/include/sys/stat.h", line 352: syntax error before or at: extern
"/usr/include/sys/stat.h", line 352: member cannot be function: mkfifoat
"/usr/include/sys/stat.h", line 380: syntax error before or at: extern
"/usr/include/sys/stat.h", line 380: member cannot be function: __fxstat
"/usr/include/sys/stat.h", line 382: syntax error before or at: extern
"/usr/include/sys/stat.h", line 382: member cannot be function: __xstat
"/usr/include/sys/stat.h", line 384: syntax error before or at: extern
"/usr/include/sys/stat.h", line 384: member cannot be function: __lxstat
"/usr/include/sys/stat.h", line 386: syntax error before or at: extern
"/usr/include/sys/stat.h", line 386: member cannot be function: __fxstatat
"/usr/include/sys/stat.h", line 413: syntax error before or at: extern
"/usr/include/sys/stat.h", line 413: member cannot be function: __fxstat64
"/usr/include/sys/stat.h", line 415: syntax error before or at: extern
"/usr/include/sys/stat.h", line 415: member cannot be function: __xstat64
"/usr/include/sys/stat.h", line 417: syntax error before or at: extern
"/usr/include/sys/stat.h", line 417: member cannot be function: __lxstat64
"/usr/include/sys/stat.h", line 419: syntax error before or at: extern
"/usr/include/sys/stat.h", line 419: member cannot be function: __fxstatat64
"/usr/include/sys/stat.h", line 423: syntax error before or at: extern
"/usr/include/sys/stat.h", line 423: member cannot be function: __xmknod
"/usr/include/sys/stat.h", line 426: syntax error before or at: extern
"/usr/include/sys/stat.h", line 426: member cannot be function: __xmknodat
"../../../../ompi/mca/pml/base/pml_base_module_exchange.h", line 32: warning: unnamed struct member
"../../../../ompi/mca/pml/base/pml_base_module_exchange.h", line 91: member cannot be function: mca_pml_base_modex_send
"../../../../ompi/mca/pml/base/pml_base_module_exchange.h", line 127: member cannot be function: mca_pml_base_modex_recv
"../../../../ompi/mca/pml/base/pml_base_module_exchange.h", line 151: syntax error before or at: typedef
"../../../../ompi/mca/pml/base/pml_base_module_exchange.h", line 161: syntax error before or at: mca_pml_base_modex_cb_fn_t
"../../../../ompi/mca/pml/base/pml_base_module_exchange.h", line 161: warning: undefined or missing type for: mca_pml_base_modex_cb_fn_t
"../../../../ompi/mca/pml/base/pml_base_module_exchange.h", line 162: warning: undefined or missing type for: void
"../../../../ompi/mca/pml/base/pml_base_module_exchange.h", line 158: member cannot be function: mca_pml_base_modex_recv_nb
"../../../../ompi/mca/pml/base/pml_base_module_exchange.h", line 167: member cannot be function: mca_pml_base_modex_exchange
"../../../../ompi/mca/pml/base/pml_base_module_exchange.h", line 172: member cannot be function: mca_pml_base_modex_init
"../../../../ompi/mca/pml/base/pml_base_module_exchange.h", line 177: member cannot be function: mca_pml_base_modex_finalize
"btl_openib_component.c", line 65: syntax error before or at: static
"btl_openib_component.c", line 65: member cannot be function: btl_openib_component_open
"btl_openib_component.c", line 66: syntax error before or at: static
"btl_openib_component.c", line 66: member cannot be function: btl_openib_component_close
"btl_openib_component.c", line 67: syntax error before or at: static
"btl_openib_component.c", line 67: member cannot be function: btl_openib_modex_send
"btl_openib_component.c", line 68: syntax error before or at: static
"btl_openib_component.c", line 68: member cannot be function: btl_openib_control
"btl_openib_component.c", line 72: syntax error before or at: static
"btl_openib_component.c", line 72: member cannot be function: init_one_port
"btl_openib_component.c", line 75: syntax error before or at: static
"btl_openib_component.c", line 75: member cannot be function: init_one_hca
"btl_openib_component.c", line 76: syntax error before or at: static
"btl_openib_component.c", line 76: member cannot be function: btl_openib_component_init
"btl_openib_component.c", line 79: syntax error before or at: static
"btl_openib_component.c", line 79: member cannot be function: merge_values
"btl_openib_component.c", line 81: syntax error before or at: static
"btl_openib_component.c", line 81: member cannot be function: btl_openib_handle_incoming
"btl_openib_component.c", line 85: syntax error before or at: static
"btl_openib_component.c", line 85: member cannot be function: btl_openib_component_status_to_string
"btl_openib_component.c", line 86: syntax error before or at: static
"btl_openib_component.c", line 86: member cannot be function: btl_openib_component_progress
"btl_openib_component.c", line 87: syntax error before or at: static
"btl_openib_component.c", line 87: member cannot be function: btl_openib_frag_progress_pending
"btl_openib_component.c", line 90: syntax error before or at: static
"btl_openib_component.c", line 90: member cannot be function: openib_reg_mr
"btl_openib_component.c", line 92: syntax error before or at: static
"btl_openib_component.c", line 92: member cannot be function: openib_dereg_mr
"btl_openib_component.c", line 95: warning: syntax requires ";" after last struct/union member
"btl_openib_component.c", line 95: syntax error before or at: =
"btl_openib_component.c", line 65: member cannot be function: btl_openib_component_open
"btl_openib_component.c", line 134: warning: syntax requires ";" after last struct/union member
"btl_openib_component.c", line 134: syntax error before or at: {
"btl_openib_component.c", line 138: syntax error before or at: mca_btl_openib_component
"btl_openib_component.c", line 139: warning: syntax requires ";" after last struct/union member
"/usr/include/infiniband/kern-abi.h", line 849: zero-sized struct/union
"btl_openib_component.c", line 142: syntax error before or at: *
"btl_openib_component.c", line 142: warning: syntax requires ";" after last struct/union member
"btl_openib_component.c", line 142: zero-sized struct/union
"btl_openib_component.c", line 142: warning: no explicit type given
"btl_openib_component.c", line 142: warning: syntax requires ";" after last struct/union member
"btl_openib_component.c", line 142: zero-sized struct/union
"btl_openib_component.c", line 142: warning: no explicit type given
"btl_openib_component.c", line 142: warning: syntax requires ";" after last struct/union member
"/usr/include/infiniband/kern-abi.h", line 849: zero-sized struct/union
"btl_openib_component.c", line 159: warning: syntax requires ";" after last struct/union member
"/usr/include/infiniband/kern-abi.h", line 838: zero-sized struct/union
"btl_openib_component.c", line 166: warning: syntax requires ";" after last struct/union member
"/usr/include/infiniband/kern-abi.h", line 829: zero-sized struct/union
"btl_openib_component.c", line 177: warning: syntax requires ";" after last struct/union member
"btl_openib_component.c", line 67: member cannot be function: btl_openib_modex_send
"btl_openib_component.c", line 193: warning: syntax requires ";" after last struct/union member
"btl_openib_component.c", line 193: syntax error before or at: {
"btl_openib_component.c", line 196: warning: syntax requires ";" after last struct/union member
"btl_openib_component.c", line 196: syntax error before or at: =
"btl_openib_component.c", line 196: warning: syntax requires ";" after last struct/union member
"/usr/include/infiniband/kern-abi.h", line 727: zero-sized struct/union
"btl_openib_component.c", line 202: warning: syntax requires ";" after last struct/union member
"/usr/include/infiniband/kern-abi.h", line 716: zero-sized struct/union
"btl_openib_component.c", line 206: warning: syntax requires ";" after last struct/union member
"/usr/include/infiniband/kern-abi.h", line 696: zero-sized struct/union
"btl_openib_component.c", line 210: warning: syntax requires ";" after last struct/union member
"/usr/include/infiniband/kern-abi.h", line 685: zero-sized struct/union
"/usr/include/infiniband/kern-abi.h", line 685: warning: unnamed struct member
"btl_openib_component.c", line 213: warning: syntax requires ";" after last struct/union member
"/usr/include/infiniband/kern-abi.h", line 674: zero-sized struct/union
"btl_openib_component.c", line 214: warning: syntax requires ";" after last struct/union member
"btl_openib_component.c", line 214: syntax error before or at: =
"btl_openib_component.c", line 215: warning: syntax requires ";" after last struct/union member
"/usr/include/infiniband/kern-abi.h", line 524: zero-sized struct/union
"btl_openib_component.c", line 218: warning: syntax requires ";" after last struct/union member
"/usr/include/infiniband/kern-abi.h", line 490: zero-sized struct/union
"btl_openib_component.c", line 225: warning: syntax requires ";" after last struct/union member
"/usr/include/infiniband/kern-abi.h", line 480: zero-sized struct/union
"/usr/include/infiniband/kern-abi.h", line 480: warning: unnamed struct member
"btl_openib_component.c", line 244: warning: syntax requires ";" after last struct/union member
"/usr/include/infiniband/kern-abi.h", line 432: zero-sized struct/union
"btl_openib_component.c", line 244: warning: syntax requires ";" after last struct/union member
"/usr/include/infiniband/kern-abi.h", line 354: zero-sized struct/union
"btl_openib_component.c", line 248: warning: syntax requires ";" after last struct/union member
"/usr/include/infiniband/kern-abi.h", line 344: zero-sized struct/union
"btl_openib_component.c", line 252: warning: syntax requires ";" after last struct/union member
"/usr/include/infiniband/kern-abi.h", line 285: zero-sized struct/union
"btl_openib_component.c", line 254: warning: syntax requires ";" after last struct/union member
"/usr/include/infiniband/kern-abi.h", line 274: zero-sized struct/union
"btl_openib_component.c", line 270: warning: syntax requires ";" after last struct/union member
"/usr/include/infiniband/kern-abi.h", line 248: zero-sized struct/union
"btl_openib_component.c", line 282: warning: syntax requires ";" after last struct/union member
"/usr/include/infiniband/kern-abi.h", line 229: zero-sized struct/union
"btl_openib_component.c", line 283: warning: syntax requires ";" after last struct/union member
"/usr/include/infiniband/kern-abi.h", line 196: zero-sized struct/union
"btl_openib_component.c", line 286: warning: syntax requires ";" after last struct/union member
"btl_openib_component.c", line 293: warning: syntax requires ";" after last struct/union member
"/usr/include/infiniband/kern-abi.h", line 144: zero-sized struct/union
"btl_openib_component.c", line 293: warning: syntax error: empty declaration
"btl_openib_component.c", line 293: warning: syntax error: empty declaration
"btl_openib_component.c", line 294: warning: syntax error: empty declaration
"btl_openib_component.c", line 298: cannot recover from previous errors
cc: acomp failed for btl_openib_component.c
gmake[2]: *** [btl_openib_component.lo] Error 1
gmake[2]: Leaving directory `/rwthfs/rz/cluster/home/pk224850/OpenMPI/openmpi-1.2.8_studio32/ompi/mca/btl/openib'
gmake[1]: *** [all-recursive] Error 1
gmake[1]: Leaving directory `/rwthfs/rz/cluster/home/pk224850/OpenMPI/openmpi-1.2.8_studio32/ompi'
gmake: *** [all-recursive] Error 1