Open MPI logo

OpenRCM Devel Mailing List Archives

  |   Home   |   Support   |   FAQ   |   all OpenRCM Devel mailing list

Subject: [orcm-devel] Installation Error with OpenRCM
From: Yao, Jianzhuang (jyao6_at_[hidden])
Date: 2011-05-17 16:50:03


Hi All,

I tried to install OpenRCM in our cluster with orcm-trunk's HACKING file.

What I do is just following the HACKING file step by step, finally I got an error when I came to the last step "make clean all install". The error message is:

-------------------------------------------------------------------------------------------------------------------
make[4]: Leaving directory `/data/charmm/bin/orcm-trunk/src/orte/mca/ess/orcmtool'
Making all in orcm
make[4]: Entering directory `/data/charmm/bin/orcm-trunk/src/orte/mca/ess/orcm'
  CC ess_orcm_component.lo
  CC ess_orcm.lo
ess_orcm.c: In function 'local_setup':
ess_orcm.c:550: error: 'orte_app_context_t' has no member named 'name'
ess_orcm.c:554: error: 'orte_app_context_t' has no member named 'name'
make[4]: *** [ess_orcm.lo] Error 1
make[4]: Leaving directory `/data/charmm/bin/orcm-trunk/src/orte/mca/ess/orcm'
make[3]: *** [all-recursive] Error 1
make[3]: Leaving directory `/data/charmm/bin/orcm-trunk/src/orte/mca/ess'
make[2]: *** [all-recursive] Error 1
make[2]: Leaving directory `/data/charmm/bin/orcm-trunk/src/orte'
make[1]: *** [all-recursive] Error 1
make[1]: Leaving directory `/data/charmm/bin/orcm-trunk/src'
make: *** [all-recursive] Error 1
--------------------------------------------------------------------------------------------------------------------

Could you please help me solve this problem?

Thanks a lot!
Jianzhuang Yao