Open MPI logo

Hardware Locality Development Mailing List Archives

  |   Home   |   Support   |   FAQ   |   all Hardware Locality Development mailing list

Subject: [hwloc-devel] === CREATE FAILURE (trunk) ===
From: MPI Team (mpiteam_at_[hidden])
Date: 2011-08-25 21:02:55


ERROR: Command returned a non-zero exist status (trunk):
       make distcheck

Start time: Thu Aug 25 21:01:02 EDT 2011
End time: Thu Aug 25 21:02:55 EDT 2011

=======================================================================
{ test ! -d "hwloc-1.4a1r3680" || { find "hwloc-1.4a1r3680" -type d ! -perm -200 -exec chmod u+w {} ';' && rm -fr "hwloc-1.4a1r3680"; }; }
test -d "hwloc-1.4a1r3680" || mkdir "hwloc-1.4a1r3680"
 (cd src && make top_distdir=../hwloc-1.4a1r3680 distdir=../hwloc-1.4a1r3680/src \
     am__remove_distdir=: am__skip_length_check=: am__skip_mode_fix=: distdir)
make[1]: Entering directory `/home/mpiteam/hwloc/nightly-tarball-build-root/trunk/create-r3680/hwloc/src'
make[1]: Leaving directory `/home/mpiteam/hwloc/nightly-tarball-build-root/trunk/create-r3680/hwloc/src'
 (cd include && make top_distdir=../hwloc-1.4a1r3680 distdir=../hwloc-1.4a1r3680/include \
     am__remove_distdir=: am__skip_length_check=: am__skip_mode_fix=: distdir)
make[1]: Entering directory `/home/mpiteam/hwloc/nightly-tarball-build-root/trunk/create-r3680/hwloc/include'
make[1]: Leaving directory `/home/mpiteam/hwloc/nightly-tarball-build-root/trunk/create-r3680/hwloc/include'
 (cd utils && make top_distdir=../hwloc-1.4a1r3680 distdir=../hwloc-1.4a1r3680/utils \
     am__remove_distdir=: am__skip_length_check=: am__skip_mode_fix=: distdir)
make[1]: Entering directory `/home/mpiteam/hwloc/nightly-tarball-build-root/trunk/create-r3680/hwloc/utils'
make[1]: Leaving directory `/home/mpiteam/hwloc/nightly-tarball-build-root/trunk/create-r3680/hwloc/utils'
 (cd tests && make top_distdir=../hwloc-1.4a1r3680 distdir=../hwloc-1.4a1r3680/tests \
     am__remove_distdir=: am__skip_length_check=: am__skip_mode_fix=: distdir)
make[1]: Entering directory `/home/mpiteam/hwloc/nightly-tarball-build-root/trunk/create-r3680/hwloc/tests'
 (cd ports && make top_distdir=../../hwloc-1.4a1r3680 distdir=../../hwloc-1.4a1r3680/tests/ports \
     am__remove_distdir=: am__skip_length_check=: am__skip_mode_fix=: distdir)
make[2]: Entering directory `/home/mpiteam/hwloc/nightly-tarball-build-root/trunk/create-r3680/hwloc/tests/ports'
make[2]: Leaving directory `/home/mpiteam/hwloc/nightly-tarball-build-root/trunk/create-r3680/hwloc/tests/ports'
 (cd xml && make top_distdir=../../hwloc-1.4a1r3680 distdir=../../hwloc-1.4a1r3680/tests/xml \
     am__remove_distdir=: am__skip_length_check=: am__skip_mode_fix=: distdir)
make[2]: Entering directory `/home/mpiteam/hwloc/nightly-tarball-build-root/trunk/create-r3680/hwloc/tests/xml'
make[2]: Leaving directory `/home/mpiteam/hwloc/nightly-tarball-build-root/trunk/create-r3680/hwloc/tests/xml'
 (cd linux && make top_distdir=../../hwloc-1.4a1r3680 distdir=../../hwloc-1.4a1r3680/tests/linux \
     am__remove_distdir=: am__skip_length_check=: am__skip_mode_fix=: distdir)
make[2]: Entering directory `/home/mpiteam/hwloc/nightly-tarball-build-root/trunk/create-r3680/hwloc/tests/linux'
 (cd gather && make top_distdir=../../../hwloc-1.4a1r3680 distdir=../../../hwloc-1.4a1r3680/tests/linux/gather \
     am__remove_distdir=: am__skip_length_check=: am__skip_mode_fix=: distdir)
make[3]: Entering directory `/home/mpiteam/hwloc/nightly-tarball-build-root/trunk/create-r3680/hwloc/tests/linux/gather'
make[3]: Leaving directory `/home/mpiteam/hwloc/nightly-tarball-build-root/trunk/create-r3680/hwloc/tests/linux/gather'
make[2]: Leaving directory `/home/mpiteam/hwloc/nightly-tarball-build-root/trunk/create-r3680/hwloc/tests/linux'
make[1]: Leaving directory `/home/mpiteam/hwloc/nightly-tarball-build-root/trunk/create-r3680/hwloc/tests'
 (cd doc && make top_distdir=../hwloc-1.4a1r3680 distdir=../hwloc-1.4a1r3680/doc \
     am__remove_distdir=: am__skip_length_check=: am__skip_mode_fix=: distdir)
make[1]: Entering directory `/home/mpiteam/hwloc/nightly-tarball-build-root/trunk/create-r3680/hwloc/doc'
/bin/mkdir -p images
/usr/bin/fig2dev -L png images/diagram.fig images/diagram.png
/bin/mkdir -p images
/usr/bin/fig2dev -L eps images/diagram.fig images/diagram.eps
rm -fr doxygen-doc
/usr/bin/doxygen /home/mpiteam/hwloc/nightly-tarball-build-root/trunk/create-r3680/hwloc/doc/doxygen.cfg
Warning: ignoring unsupported tag `DOXYFILE_ENCODING =' at line 39, file /home/mpiteam/hwloc/nightly-tarball-build-root/trunk/create-r3680/hwloc/doc/doxygen.cfg
Warning: ignoring unsupported tag `QT_AUTOBRIEF =' at line 165, file /home/mpiteam/hwloc/nightly-tarball-build-root/trunk/create-r3680/hwloc/doc/doxygen.cfg
Warning: ignoring unsupported tag `SEPARATE_MEMBER_PAGES =' at line 185, file /home/mpiteam/hwloc/nightly-tarball-build-root/trunk/create-r3680/hwloc/doc/doxygen.cfg
Warning: ignoring unsupported tag `OPTIMIZE_FOR_FORTRAN =' at line 219, file /home/mpiteam/hwloc/nightly-tarball-build-root/trunk/create-r3680/hwloc/doc/doxygen.cfg
Warning: ignoring unsupported tag `OPTIMIZE_OUTPUT_VHDL =' at line 225, file /home/mpiteam/hwloc/nightly-tarball-build-root/trunk/create-r3680/hwloc/doc/doxygen.cfg
Warning: ignoring unsupported tag `EXTENSION_MAPPING =' at line 236, file /home/mpiteam/hwloc/nightly-tarball-build-root/trunk/create-r3680/hwloc/doc/doxygen.cfg
Warning: ignoring unsupported tag `BUILTIN_STL_SUPPORT =' at line 245, file /home/mpiteam/hwloc/nightly-tarball-build-root/trunk/create-r3680/hwloc/doc/doxygen.cfg
Warning: ignoring unsupported tag `CPP_CLI_SUPPORT =' at line 250, file /home/mpiteam/hwloc/nightly-tarball-build-root/trunk/create-r3680/hwloc/doc/doxygen.cfg
Warning: ignoring unsupported tag `SIP_SUPPORT =' at line 256, file /home/mpiteam/hwloc/nightly-tarball-build-root/trunk/create-r3680/hwloc/doc/doxygen.cfg
Warning: ignoring unsupported tag `IDL_PROPERTY_SUPPORT =' at line 265, file /home/mpiteam/hwloc/nightly-tarball-build-root/trunk/create-r3680/hwloc/doc/doxygen.cfg
Warning: ignoring unsupported tag `TYPEDEF_HIDES_STRUCT =' at line 290, file /home/mpiteam/hwloc/nightly-tarball-build-root/trunk/create-r3680/hwloc/doc/doxygen.cfg
Warning: ignoring unsupported tag `SYMBOL_CACHE_SIZE =' at line 306, file /home/mpiteam/hwloc/nightly-tarball-build-root/trunk/create-r3680/hwloc/doc/doxygen.cfg
Warning: ignoring unsupported tag `EXTRACT_ANON_NSPACES =' at line 348, file /home/mpiteam/hwloc/nightly-tarball-build-root/trunk/create-r3680/hwloc/doc/doxygen.cfg
Warning: ignoring unsupported tag `SORT_GROUP_NAMES =' at line 429, file /home/mpiteam/hwloc/nightly-tarball-build-root/trunk/create-r3680/hwloc/doc/doxygen.cfg
Warning: ignoring unsupported tag `SHOW_FILES =' at line 496, file /home/mpiteam/hwloc/nightly-tarball-build-root/trunk/create-r3680/hwloc/doc/doxygen.cfg
Warning: ignoring unsupported tag `SHOW_NAMESPACES =' at line 503, file /home/mpiteam/hwloc/nightly-tarball-build-root/trunk/create-r3680/hwloc/doc/doxygen.cfg
Warning: ignoring unsupported tag `FILE_VERSION_FILTER =' at line 513, file /home/mpiteam/hwloc/nightly-tarball-build-root/trunk/create-r3680/hwloc/doc/doxygen.cfg
Warning: ignoring unsupported tag `LAYOUT_FILE =' at line 522, file /home/mpiteam/hwloc/nightly-tarball-build-root/trunk/create-r3680/hwloc/doc/doxygen.cfg
Warning: ignoring unsupported tag `WARN_NO_PARAMDOC =' at line 558, file /home/mpiteam/hwloc/nightly-tarball-build-root/trunk/create-r3680/hwloc/doc/doxygen.cfg
Warning: ignoring unsupported tag `INPUT_ENCODING =' at line 593, file /home/mpiteam/hwloc/nightly-tarball-build-root/trunk/create-r3680/hwloc/doc/doxygen.cfg
Warning: ignoring unsupported tag `EXCLUDE_SYMBOLS =' at line 636, file /home/mpiteam/hwloc/nightly-tarball-build-root/trunk/create-r3680/hwloc/doc/doxygen.cfg
Warning: ignoring unsupported tag `REFERENCES_LINK_SOURCE =' at line 734, file /home/mpiteam/hwloc/nightly-tarball-build-root/trunk/create-r3680/hwloc/doc/doxygen.cfg
Warning: ignoring unsupported tag `USE_HTAGS =' at line 742, file /home/mpiteam/hwloc/nightly-tarball-build-root/trunk/create-r3680/hwloc/doc/doxygen.cfg
Warning: ignoring unsupported tag `HTML_DYNAMIC_SECTIONS =' at line 827, file /home/mpiteam/hwloc/nightly-tarball-build-root/trunk/create-r3680/hwloc/doc/doxygen.cfg
Warning: ignoring unsupported tag `GENERATE_DOCSET =' at line 839, file /home/mpiteam/hwloc/nightly-tarball-build-root/trunk/create-r3680/hwloc/doc/doxygen.cfg
Warning: ignoring unsupported tag `DOCSET_FEEDNAME =' at line 846, file /home/mpiteam/hwloc/nightly-tarball-build-root/trunk/create-r3680/hwloc/doc/doxygen.cfg
Warning: ignoring unsupported tag `DOCSET_BUNDLE_ID =' at line 853, file /home/mpiteam/hwloc/nightly-tarball-build-root/trunk/create-r3680/hwloc/doc/doxygen.cfg
Warning: ignoring unsupported tag `CHM_INDEX_ENCODING =' at line 886, file /home/mpiteam/hwloc/nightly-tarball-build-root/trunk/create-r3680/hwloc/doc/doxygen.cfg
Warning: ignoring unsupported tag `GENERATE_QHP =' at line 904, file /home/mpiteam/hwloc/nightly-tarball-build-root/trunk/create-r3680/hwloc/doc/doxygen.cfg
Warning: ignoring unsupported tag `QCH_FILE =' at line 910, file /home/mpiteam/hwloc/nightly-tarball-build-root/trunk/create-r3680/hwloc/doc/doxygen.cfg
Warning: ignoring unsupported tag `QHP_NAMESPACE =' at line 916, file /home/mpiteam/hwloc/nightly-tarball-build-root/trunk/create-r3680/hwloc/doc/doxygen.cfg
Warning: ignoring unsupported tag `QHP_VIRTUAL_FOLDER =' at line 922, file /home/mpiteam/hwloc/nightly-tarball-build-root/trunk/create-r3680/hwloc/doc/doxygen.cfg
Warning: ignoring unsupported tag `QHP_CUST_FILTER_NAME =' at line 928, file /home/mpiteam/hwloc/nightly-tarball-build-root/trunk/create-r3680/hwloc/doc/doxygen.cfg
Warning: ignoring unsupported tag `QHP_CUST_FILTER_ATTRS =' at line 933, file /home/mpiteam/hwloc/nightly-tarball-build-root/trunk/create-r3680/hwloc/doc/doxygen.cfg
Warning: ignoring unsupported tag `QHP_SECT_FILTER_ATTRS =' at line 939, file /home/mpiteam/hwloc/nightly-tarball-build-root/trunk/create-r3680/hwloc/doc/doxygen.cfg
Warning: ignoring unsupported tag `QHG_LOCATION =' at line 946, file /home/mpiteam/hwloc/nightly-tarball-build-root/trunk/create-r3680/hwloc/doc/doxygen.cfg
Warning: ignoring unsupported tag `FORMULA_FONTSIZE =' at line 988, file /home/mpiteam/hwloc/nightly-tarball-build-root/trunk/create-r3680/hwloc/doc/doxygen.cfg
Warning: ignoring unsupported tag `LATEX_SOURCE_CODE =' at line 1068, file /home/mpiteam/hwloc/nightly-tarball-build-root/trunk/create-r3680/hwloc/doc/doxygen.cfg
Warning: ignoring unsupported tag `MSCGEN_PATH =' at line 1354, file /home/mpiteam/hwloc/nightly-tarball-build-root/trunk/create-r3680/hwloc/doc/doxygen.cfg
Warning: ignoring unsupported tag `DOT_FONTNAME =' at line 1378, file /home/mpiteam/hwloc/nightly-tarball-build-root/trunk/create-r3680/hwloc/doc/doxygen.cfg
Warning: ignoring unsupported tag `DOT_FONTSIZE =' at line 1383, file /home/mpiteam/hwloc/nightly-tarball-build-root/trunk/create-r3680/hwloc/doc/doxygen.cfg
Warning: ignoring unsupported tag `DOT_FONTPATH =' at line 1390, file /home/mpiteam/hwloc/nightly-tarball-build-root/trunk/create-r3680/hwloc/doc/doxygen.cfg
Warning: ignoring unsupported tag `GROUP_GRAPHS =' at line 1409, file /home/mpiteam/hwloc/nightly-tarball-build-root/trunk/create-r3680/hwloc/doc/doxygen.cfg
Warning: ignoring unsupported tag `CALLER_GRAPH =' at line 1450, file /home/mpiteam/hwloc/nightly-tarball-build-root/trunk/create-r3680/hwloc/doc/doxygen.cfg
Warning: ignoring unsupported tag `DIRECTORY_GRAPH =' at line 1462, file /home/mpiteam/hwloc/nightly-tarball-build-root/trunk/create-r3680/hwloc/doc/doxygen.cfg
Warning: ignoring unsupported tag `DOT_GRAPH_MAX_NODES =' at line 1489, file /home/mpiteam/hwloc/nightly-tarball-build-root/trunk/create-r3680/hwloc/doc/doxygen.cfg
Warning: ignoring unsupported tag `DOT_TRANSPARENT =' at line 1507, file /home/mpiteam/hwloc/nightly-tarball-build-root/trunk/create-r3680/hwloc/doc/doxygen.cfg
Warning: ignoring unsupported tag `DOT_MULTI_TARGETS =' at line 1514, file /home/mpiteam/hwloc/nightly-tarball-build-root/trunk/create-r3680/hwloc/doc/doxygen.cfg
Warning: argument `NONE' for option GENERATE_TREEVIEW is not a valid boolean value
Using the default: NO!
Notice: Output directory `../doc/doxygen-doc' does not exist. I have created it for you.
/home/mpiteam/hwloc/nightly-tarball-build-root/trunk/create-r3680/hwloc/include/hwloc/helper.h:660: Warning: member hwloc_distributev: ignoring the detailed description found here, since another one was found at line 630 of file /home/mpiteam/hwloc/nightly-tarball-build-root/trunk/create-r3680/hwloc/include/hwloc/helper.h!
/home/mpiteam/hwloc/nightly-tarball-build-root/trunk/create-r3680/hwloc/include/hwloc/helper.h:660: Warning: member hwloc_distributev: ignoring the brief description found here, since another one was found at line 630 of file /home/mpiteam/hwloc/nightly-tarball-build-root/trunk/create-r3680/hwloc/include/hwloc/helper.h!
/home/mpiteam/hwloc/nightly-tarball-build-root/trunk/create-r3680/hwloc/doc/hwloc.doxy:267: Warning: Illegal command textwidth as part of a \image
/home/mpiteam/hwloc/nightly-tarball-build-root/trunk/create-r3680/hwloc/doc/hwloc.doxy:425: Warning: unable to resolve reference to `termsanddefs' for \ref command
/home/mpiteam/hwloc/nightly-tarball-build-root/trunk/create-r3680/hwloc/doc/hwloc.doxy:435: Warning: unable to resolve reference to `interoperability' for \ref command
/home/mpiteam/hwloc/nightly-tarball-build-root/trunk/create-r3680/hwloc/doc/hwloc.doxy:624: Warning: unable to resolve reference to `termsanddefs' for \ref command
/home/mpiteam/hwloc/nightly-tarball-build-root/trunk/create-r3680/hwloc/doc/hwloc.doxy:625: Warning: unable to resolve reference to `tools' for \ref command
/home/mpiteam/hwloc/nightly-tarball-build-root/trunk/create-r3680/hwloc/doc/hwloc.doxy:626: Warning: unable to resolve reference to `envvar' for \ref command
/home/mpiteam/hwloc/nightly-tarball-build-root/trunk/create-r3680/hwloc/doc/hwloc.doxy:627: Warning: unable to resolve reference to `cpu_mem_bind' for \ref command
/home/mpiteam/hwloc/nightly-tarball-build-root/trunk/create-r3680/hwloc/doc/hwloc.doxy:628: Warning: unable to resolve reference to `iodevices' for \ref command
/home/mpiteam/hwloc/nightly-tarball-build-root/trunk/create-r3680/hwloc/doc/hwloc.doxy:629: Warning: unable to resolve reference to `interoperability' for \ref command
/home/mpiteam/hwloc/nightly-tarball-build-root/trunk/create-r3680/hwloc/doc/hwloc.doxy:630: Warning: unable to resolve reference to `threadsafety' for \ref command
/home/mpiteam/hwloc/nightly-tarball-build-root/trunk/create-r3680/hwloc/doc/hwloc.doxy:631: Warning: unable to resolve reference to `embed' for \ref command
/home/mpiteam/hwloc/nightly-tarball-build-root/trunk/create-r3680/hwloc/doc/hwloc.doxy:632: Warning: unable to resolve reference to `faq' for \ref command
/home/mpiteam/hwloc/nightly-tarball-build-root/trunk/create-r3680/hwloc/doc/hwloc.doxy:643: Warning: Found unknown command `\page'
/home/mpiteam/hwloc/nightly-tarball-build-root/trunk/create-r3680/hwloc/doc/hwloc.doxy:754: Warning: Illegal command textwidth as part of a \image
/home/mpiteam/hwloc/nightly-tarball-build-root/trunk/create-r3680/hwloc/doc/hwloc.doxy:762: Warning: Found unknown command `\page'
/home/mpiteam/hwloc/nightly-tarball-build-root/trunk/create-r3680/hwloc/doc/hwloc.doxy:835: Warning: Found unknown command `\page'
/home/mpiteam/hwloc/nightly-tarball-build-root/trunk/create-r3680/hwloc/doc/hwloc.doxy:954: Warning: Found unknown command `\page'
/home/mpiteam/hwloc/nightly-tarball-build-root/trunk/create-r3680/hwloc/doc/hwloc.doxy:1012: Warning: Found unknown command `\page'
/home/mpiteam/hwloc/nightly-tarball-build-root/trunk/create-r3680/hwloc/doc/hwloc.doxy:1081: Warning: unable to resolve reference to `interoperability' for \ref command
/home/mpiteam/hwloc/nightly-tarball-build-root/trunk/create-r3680/hwloc/doc/hwloc.doxy:1175: Warning: Found unknown command `\page'
/home/mpiteam/hwloc/nightly-tarball-build-root/trunk/create-r3680/hwloc/doc/hwloc.doxy:1256: Warning: Found unknown command `\page'
/home/mpiteam/hwloc/nightly-tarball-build-root/trunk/create-r3680/hwloc/doc/hwloc.doxy:1319: Warning: Found unknown command `\page'
/home/mpiteam/hwloc/nightly-tarball-build-root/trunk/create-r3680/hwloc/doc/hwloc.doxy:1487: Warning: Found unknown command `\page'
/home/mpiteam/hwloc/nightly-tarball-build-root/trunk/create-r3680/hwloc/doc/hwloc.doxy:267: Warning: Illegal command textwidth as part of a \image
/home/mpiteam/hwloc/nightly-tarball-build-root/trunk/create-r3680/hwloc/doc/hwloc.doxy:425: Warning: unable to resolve reference to `termsanddefs' for \ref command
/home/mpiteam/hwloc/nightly-tarball-build-root/trunk/create-r3680/hwloc/doc/hwloc.doxy:435: Warning: unable to resolve reference to `interoperability' for \ref command
/home/mpiteam/hwloc/nightly-tarball-build-root/trunk/create-r3680/hwloc/doc/hwloc.doxy:624: Warning: unable to resolve reference to `termsanddefs' for \ref command
/home/mpiteam/hwloc/nightly-tarball-build-root/trunk/create-r3680/hwloc/doc/hwloc.doxy:625: Warning: unable to resolve reference to `tools' for \ref command
/home/mpiteam/hwloc/nightly-tarball-build-root/trunk/create-r3680/hwloc/doc/hwloc.doxy:626: Warning: unable to resolve reference to `envvar' for \ref command
/home/mpiteam/hwloc/nightly-tarball-build-root/trunk/create-r3680/hwloc/doc/hwloc.doxy:627: Warning: unable to resolve reference to `cpu_mem_bind' for \ref command
/home/mpiteam/hwloc/nightly-tarball-build-root/trunk/create-r3680/hwloc/doc/hwloc.doxy:628: Warning: unable to resolve reference to `iodevices' for \ref command
/home/mpiteam/hwloc/nightly-tarball-build-root/trunk/create-r3680/hwloc/doc/hwloc.doxy:629: Warning: unable to resolve reference to `interoperability' for \ref command
/home/mpiteam/hwloc/nightly-tarball-build-root/trunk/create-r3680/hwloc/doc/hwloc.doxy:630: Warning: unable to resolve reference to `threadsafety' for \ref command
/home/mpiteam/hwloc/nightly-tarball-build-root/trunk/create-r3680/hwloc/doc/hwloc.doxy:631: Warning: unable to resolve reference to `embed' for \ref command
/home/mpiteam/hwloc/nightly-tarball-build-root/trunk/create-r3680/hwloc/doc/hwloc.doxy:632: Warning: unable to resolve reference to `faq' for \ref command
/home/mpiteam/hwloc/nightly-tarball-build-root/trunk/create-r3680/hwloc/doc/hwloc.doxy:643: Warning: Found unknown command `\page'
/home/mpiteam/hwloc/nightly-tarball-build-root/trunk/create-r3680/hwloc/doc/hwloc.doxy:754: Warning: Illegal command textwidth as part of a \image
/home/mpiteam/hwloc/nightly-tarball-build-root/trunk/create-r3680/hwloc/doc/hwloc.doxy:762: Warning: Found unknown command `\page'
/home/mpiteam/hwloc/nightly-tarball-build-root/trunk/create-r3680/hwloc/doc/hwloc.doxy:835: Warning: Found unknown command `\page'
/home/mpiteam/hwloc/nightly-tarball-build-root/trunk/create-r3680/hwloc/doc/hwloc.doxy:954: Warning: Found unknown command `\page'
/home/mpiteam/hwloc/nightly-tarball-build-root/trunk/create-r3680/hwloc/doc/hwloc.doxy:1012: Warning: Found unknown command `\page'
/home/mpiteam/hwloc/nightly-tarball-build-root/trunk/create-r3680/hwloc/doc/hwloc.doxy:1081: Warning: unable to resolve reference to `interoperability' for \ref command
/home/mpiteam/hwloc/nightly-tarball-build-root/trunk/create-r3680/hwloc/doc/hwloc.doxy:1175: Warning: Found unknown command `\page'
/home/mpiteam/hwloc/nightly-tarball-build-root/trunk/create-r3680/hwloc/doc/hwloc.doxy:1256: Warning: Found unknown command `\page'
/home/mpiteam/hwloc/nightly-tarball-build-root/trunk/create-r3680/hwloc/doc/hwloc.doxy:1319: Warning: Found unknown command `\page'
/home/mpiteam/hwloc/nightly-tarball-build-root/trunk/create-r3680/hwloc/doc/hwloc.doxy:1487: Warning: Found unknown command `\page'
Searching for include files...
Searching for example files...
Searching for images...
Searching for dot files...
Searching for files to exclude
Reading input files...
Reading and parsing tag files
Preprocessing /home/mpiteam/hwloc/nightly-tarball-build-root/trunk/create-r3680/hwloc/doc/hwloc.doxy...
Preprocessing /home/mpiteam/hwloc/nightly-tarball-build-root/trunk/create-r3680/hwloc/include/hwloc.h...
Preprocessing /home/mpiteam/hwloc/nightly-tarball-build-root/trunk/create-r3680/hwloc/include/hwloc/helper.h...
Preprocessing /home/mpiteam/hwloc/nightly-tarball-build-root/trunk/create-r3680/hwloc/include/hwloc/bitmap.h...
Preprocessing /home/mpiteam/hwloc/nightly-tarball-build-root/trunk/create-r3680/hwloc/include/hwloc/glibc-sched.h...
Preprocessing /home/mpiteam/hwloc/nightly-tarball-build-root/trunk/create-r3680/hwloc/include/hwloc/linux.h...
Preprocessing /home/mpiteam/hwloc/nightly-tarball-build-root/trunk/create-r3680/hwloc/include/hwloc/linux-libnuma.h...
Preprocessing /home/mpiteam/hwloc/nightly-tarball-build-root/trunk/create-r3680/hwloc/include/hwloc/cuda.h...
Preprocessing /home/mpiteam/hwloc/nightly-tarball-build-root/trunk/create-r3680/hwloc/include/hwloc/cudart.h...
Preprocessing /home/mpiteam/hwloc/nightly-tarball-build-root/trunk/create-r3680/hwloc/include/hwloc/openfabrics-verbs.h...
Preprocessing /home/mpiteam/hwloc/nightly-tarball-build-root/trunk/create-r3680/hwloc/include/hwloc/myriexpress.h...
Read 235224 bytes
Parsing input...
Parsing file /home/mpiteam/hwloc/nightly-tarball-build-root/trunk/create-r3680/hwloc/doc/hwloc.doxy...
Parsing file /home/mpiteam/hwloc/nightly-tarball-build-root/trunk/create-r3680/hwloc/include/hwloc.h...
Parsing file /home/mpiteam/hwloc/nightly-tarball-build-root/trunk/create-r3680/hwloc/include/hwloc/helper.h...
Parsing file /home/mpiteam/hwloc/nightly-tarball-build-root/trunk/create-r3680/hwloc/include/hwloc/bitmap.h...
Parsing file /home/mpiteam/hwloc/nightly-tarball-build-root/trunk/create-r3680/hwloc/include/hwloc/glibc-sched.h...
Parsing file /home/mpiteam/hwloc/nightly-tarball-build-root/trunk/create-r3680/hwloc/include/hwloc/linux.h...
Parsing file /home/mpiteam/hwloc/nightly-tarball-build-root/trunk/create-r3680/hwloc/include/hwloc/linux-libnuma.h...
Parsing file /home/mpiteam/hwloc/nightly-tarball-build-root/trunk/create-r3680/hwloc/include/hwloc/cuda.h...
Parsing file /home/mpiteam/hwloc/nightly-tarball-build-root/trunk/create-r3680/hwloc/include/hwloc/cudart.h...
Parsing file /home/mpiteam/hwloc/nightly-tarball-build-root/trunk/create-r3680/hwloc/include/hwloc/openfabrics-verbs.h...
Parsing file /home/mpiteam/hwloc/nightly-tarball-build-root/trunk/create-r3680/hwloc/include/hwloc/myriexpress.h...
Freeing input...
Building group list...
Building directory list...
Building namespace list...
Building file list...
Searching for included using directives...
Building class list...
Building example list...
Searching for documented variables...
Building member list...
Searching for friends...
Searching for documented defines...
Computing template instances...
Flushing cached template relations that have become invalid...
Creating members for template instances...
Computing class relations...
Searching for enumerations...
Searching for members imported via using declarations...
Searching for member function documentation...
Building page list...
Search for main page...
Sorting lists...
Freeing entry tree
Determining which enums are documented
Computing member relations...
Building full member lists recursively...
Adding members to member groups.
Computing member references...
Inheriting documentation...
Generating disk names...
Adding source references...
Adding todo/test/bug list items...
Generating style sheet...
Counting data structures...
Resolving user defined references...
Combining using relations...
Finding anchors and sections in the documentation...
Generating index page...
Generating file index...
Generating example documentation...
Generating file sources...
Generating code for file bitmap.h...
Generating code for file cuda.h...
Generating code for file cuda/home/mpiteam/hwloc/nightly-tarball-build-root/trunk/create-r3680/hwloc/include/hwloc.h:213: Warning: Found unknown command `\private'
rt.h...
Generating code for file glibc-sched.h...
Generating code for file helper.h...
Generating code for file hwloc.h...
Generating code for file linux-libnuma.h...
Generating code for file linux.h...
Generating code for file myriexpress.h...
Generating code for file openfabrics-verbs.h...
Generating file documentation...
Generating docs for file bitmap.h...
Generating docs for file cuda.h...
Generating docs for file cudart.h...
Generating docs for file glibc-sched.h...
Generating docs for file helper.h...
Generating docs for file hwloc.doxy...
Generating docs for file hwloc.h...
Generating docs for file linux-libnuma.h...
Generating docs for file linux.h...
Generating docs for file myriexpress.h...
Generating docs for file openfabrics-verbs.h...
Generating class documentation...
Generating annotated compound index...
Generating hierarchical class index...
Generating member index...
Generating docs for compound hwloc_distances_s...
Generating docs for compound hwloc_obj...
Generating docs for compound hwloc_obj_attr_u...
Generating docs for nested compound hwloc_obj_attr_u::hwloc_bridge_attr_s...
Generating docs for nested compound hwloc_obj_attr_u::hwloc_cache_attr_s...
Generating docs for nested compound hwloc_obj_attr_u::hwloc_group_attr_s...
Generating docs for nested compound hwloc_obj_attr_u::hwloc_osdev_attr_s...
Generating docs for nested compound hwloc_obj_attr_u::hwloc_pcidev_attr_s...
Generating docs for compound hwloc_obj_info_s...
Generating docs for compound hwloc_obj_memory_s...
Generating docs for nested compound hwloc_obj_memory_s::hwloc_obj_memory_page_type_s...
Generating docs for compound hwloc_topology_cpubind_support...
Generating docs for compound hwloc_topology_discovery_support...
Generating docs for compound hwloc_topology_membind_support...
Generating docs for compound hwloc_topology_support...
Generating page documentation...
Generating group documentation...
Generating namespace index...
Generating group index...
Generating example index...
Generating file member index...
Generating namespace member index...
Generating page index...
Generating graph info page...
/bin/sed -i -e 's/__hwloc_restrict/restrict/g' \
          -e 's/\\_\\-\\_\\-hwloc\\_\\-restrict/restrict/g' \
          -e 's/__hwloc_attribute_unused//g' \
          -e 's/\\_\\-\\_\\-hwloc\\_\\-attribute\\_\\-unused//g' \
          -e 's/__hwloc_attribute_malloc//g' \
          -e 's/\\_\\-\\_\\-hwloc\\_\\-attribute\\_\\-malloc//g' \
          -e 's/__hwloc_attribute_const//g' \
          -e 's/\\_\\-\\_\\-hwloc\\_\\-attribute\\_\\-const//g' \
          -e 's/__hwloc_attribute_pure//g' \
          -e 's/\\_\\-\\_\\-hwloc\\_\\-attribute\\_\\-pure//g' \
          -e 's/__hwloc_attribute_deprecated//g' \
          -e 's/\\_\\-\\_\\-hwloc\\_\\-attribute\\_\\-deprecated//g' \
          -e 's/HWLOC_DECLSPEC//g' \
          -e 's/HWLOC\\_\\-DECLSPEC//g' \
          -e 's/__hwloc_inline/inline/g' \
          -e 's/\\_\\-\\_\\-hwloc\\_\\-inline/inline/g' \
doxygen-doc/html/*.html doxygen-doc/latex/*.tex doxygen-doc/man/man3/*.3
Work-around spurious leading _ in doxygen filenames...
(cd doxygen-doc/man/man3 ; \
for i in _hwloc* ; do \
        [ ! -f $i ] || mv $i ${i#_} ; \
done)
Removing useless manpages...
cd doxygen-doc/latex; \
rm -f *.aux *.toc *.idx *.ind *.ilg *.log *.out; \
/bin/sed -e 's/a4paper/letterpaper/g' -e 's/\\usepackage{a4wide}//' refman.tex > letter-refman.tex; \
/usr/bin/pdflatex letter-refman.tex; \
/usr/bin/makeindex letter-refman.idx; \
/usr/bin/pdflatex letter-refman.tex; \
done=0; repeat=5; \
while test $done = 0 -a $repeat -gt 0; do \
           if /bin/grep -E 'Rerun (LaTeX|to get cross-references right)' letter-refman.log > /dev/null 2>&1; then \
       /usr/bin/pdflatex letter-refman.tex; \
       repeat=`expr $repeat - 1`; \
   else \
       done=1; \
   fi; \
done; \
mv letter-refman.pdf /home/mpiteam/hwloc/nightly-tarball-build-root/trunk/create-r3680/hwloc/doc/doxygen-doc/hwloc-letter.pdf
This is pdfTeX, Version 3.14159-1.10b (Web2C 7.4.5)
(./letter-refman.tex{/usr/share/texmf/pdftex/config/pdftex.cfg}
LaTeX2e <2001/06/01>
Babel <v3.7h> and hyphenation patterns for american, french, german, ngerman, n
ohyphenation, loaded.
(/usr/share/texmf/tex/latex/base/book.cls
Document Class: book 2001/04/21 v1.4e Standard LaTeX document class
(/usr/share/texmf/tex/latex/base/bk10.clo))
(/usr/share/texmf/tex/latex/base/makeidx.sty)
(/usr/share/texmf/tex/latex/fancyhdr/fancyhdr.sty)
(/usr/share/texmf/tex/latex/graphics/graphicx.sty
(/usr/share/texmf/tex/latex/graphics/keyval.sty)
(/usr/share/texmf/tex/latex/graphics/graphics.sty
(/usr/share/texmf/tex/latex/graphics/trig.sty)
(/usr/share/texmf/tex/latex/config/graphics.cfg)
(/usr/share/texmf/tex/latex/graphics/pdftex.def)))
(/usr/share/texmf/tex/latex/tools/multicol.sty)
(/usr/share/texmf/tex/latex/misc/float.sty)
(/usr/share/texmf/tex/latex/base/textcomp.sty
(/usr/share/texmf/tex/latex/base/ts1enc.def))
(/usr/share/texmf/tex/latex/base/alltt.sty)
(/usr/share/texmf/tex/latex/psnfss/times.sty)
(/usr/share/texmf/tex/latex/hyperref/hyperref.sty
(/usr/share/texmf/tex/latex/hyperref/pd1enc.def)
(/usr/share/texmf/tex/latex/config/hyperref.cfg)
Implicit mode ON; LaTeX internals redefined
(/usr/share/texmf/tex/latex/hyperref/backref.sty)
(/usr/share/texmf/tex/latex/html/url.sty))
*hyperref using driver hpdftex*
(/usr/share/texmf/tex/latex/hyperref/hpdftex.def
(/usr/share/texmf/tex/latex/psnfss/pifont.sty
(/usr/share/texmf/tex/latex/psnfss/upzd.fd)
(/usr/share/texmf/tex/latex/psnfss/upsy.fd))) (./doxygen.sty
(/usr/share/texmf/tex/latex/tools/calc.sty)
(/usr/share/texmf/tex/latex/tools/array.sty))
(/usr/share/texmf/tex/latex/base/fontenc.sty
(/usr/share/texmf/tex/latex/base/t1enc.def))
Writing index file letter-refman.idx
No file letter-refman.aux.
(/usr/share/texmf/tex/latex/base/ts1cmr.fd)
(/usr/share/texmf/tex/latex/psnfss/t1ptm.fd)
(/usr/share/texmf/tex/context/base/supp-pdf.tex
(/usr/share/texmf/tex/context/base/supp-mis.tex
loading : Context Support Macros / Missing
)
loading : Context Support Macros / PDF
) (/usr/share/texmf/tex/latex/graphics/color.sty
(/usr/share/texmf/tex/latex/config/color.cfg))
(/usr/share/texmf/tex/latex/hyperref/nameref.sty) [1{/usr/share/texmf/dvips/con
fig/pdftex.map}] [2]
! pdfTeX warning (ext4): destination with the same identifier (name{page.1}) ha
s been already used, duplicate ignored
<to be read again>
                   \penalty
l.44 \clearemptydoublepage
                           [1]
! pdfTeX warning (ext4): destination with the same identifier (name{page.2}) ha
s been already used, duplicate ignored
<to be read again>
                   \penalty
l.44 \clearemptydoublepage
                           [2]
Chapter 1.
(./index.tex (/usr/share/texmf/tex/latex/psnfss/ts1ptm.fd)
! pdfTeX warning (ext4): destination with the same identifier (name{page.1}) ha
s been already used, duplicate ignored
<to be read again>
                   \penalty
l.17 ...d support) \item Solaris \item AIX \item D
                                                  arwin / OS X \item Free\-B...
[1] (/usr/share/texmf/tex/latex/psnfss/t1pcr.fd)
! pdfTeX warning (ext4): destination with the same identifier (name{page.2}) ha
s been already used, duplicate ignored
<to be read again>
                   \penalty
l.44
      [2] <dudley.png, id=53, 451.6875pt x 572.1375pt> <use dudley.png>
Underfull \vbox (badness 1048) has occurred while \output is active [3]
[4 <./dudley.png>]
Overfull \hbox (10.20023pt too wide) in paragraph at lines 186--186
[] /pcrr8t_at_8.0pt/dmi_board_vendor="Dell Computer Corporation" dmi_board_na
me="0RD318"[]

Overfull \hbox (0.60022pt too wide) in paragraph at lines 186--186
[] /pcrr8t_at_8.0pt/<object type="Socket" os_level="-1" os_index="0" cpuset="0x
00001111"[]

Overfull \hbox (29.40024pt too wide) in paragraph at lines 186--186
[] /pcrr8t_at_8.0pt/<object type="Core" os_level="-1" os_index="0" cpus
et="0x00000101"[]

Overfull \hbox (29.40024pt too wide) in paragraph at lines 186--186
[] /pcrr8t_at_8.0pt/<object type="PU" os_level="-1" os_index="0" cpus
et="0x00000001"[]

Overfull \hbox (5.40022pt too wide) in paragraph at lines 186--186
[] /pcrr8t_at_8.0pt/complete_cpuset="0x00000001" online_cpuset="0
x00000001"[]

Overfull \hbox (29.40024pt too wide) in paragraph at lines 186--186
[] /pcrr8t_at_8.0pt/<object type="PU" os_level="-1" os_index="8" cpus
et="0x00000100"[]

Overfull \hbox (5.40022pt too wide) in paragraph at lines 186--186
[] /pcrr8t_at_8.0pt/complete_cpuset="0x00000100" online_cpuset="0
x00000100"[]
[5]
Overfull \hbox (29.40024pt too wide) in paragraph at lines 186--186
[] /pcrr8t_at_8.0pt/<object type="Core" os_level="-1" os_index="1" cpus
et="0x00001010"[]

Overfull \hbox (29.40024pt too wide) in paragraph at lines 186--186
[] /pcrr8t_at_8.0pt/<object type="PU" os_level="-1" os_index="4" cpus
et="0x00000010"[]

Overfull \hbox (5.40022pt too wide) in paragraph at lines 186--186
[] /pcrr8t_at_8.0pt/complete_cpuset="0x00000010" online_cpuset="0
x00000010"[]

Overfull \hbox (34.20024pt too wide) in paragraph at lines 186--186
[] /pcrr8t_at_8.0pt/<object type="PU" os_level="-1" os_index="12" cpu
set="0x00001000"[]

Overfull \hbox (5.40022pt too wide) in paragraph at lines 186--186
[] /pcrr8t_at_8.0pt/complete_cpuset="0x00001000" online_cpuset="0
x00001000"[]
<hagrid.png, id=74, 973.6375pt x 291.0875pt> <use hagrid.png>
Overfull \hbox (628.63512pt too wide) in paragraph at lines 194--194
 []

Underfull \vbox (badness 10000) has occurred while \output is active [6]
[7 <./hagrid.png>]
Overfull \hbox (10.20023pt too wide) in paragraph at lines 271--271
[] /pcrr8t_at_8.0pt/<object type="NUMANode" os_level="-1" os_index="0" cpuset="
0x00000003"[]

Overfull \hbox (10.20023pt too wide) in paragraph at lines 271--271
[] /pcrr8t_at_8.0pt/<object type="Socket" os_level="-1" os_index="0" cpuset="
0x00000003"[]

Overfull \hbox (0.60022pt too wide) in paragraph at lines 271--271
[] /pcrr8t_at_8.0pt/complete_nodeset="0x00000001" allowed_nodeset="0x
00000001"[]

Overfull \hbox (29.40024pt too wide) in paragraph at lines 271--271
[] /pcrr8t_at_8.0pt/<object type="PU" os_level="-1" os_index="0" cpus
et="0x00000001"[]

Overfull \hbox (5.40022pt too wide) in paragraph at lines 271--271
[] /pcrr8t_at_8.0pt/complete_cpuset="0x00000001" online_cpuset="0
x00000001"[]

Overfull \hbox (29.40024pt too wide) in paragraph at lines 271--271
[] /pcrr8t_at_8.0pt/complete_nodeset="0x00000001" allowed_nodeset
="0x00000001"/>[]
<emmett.png, id=84, 431.6125pt x 431.6125pt> <use emmett.png>
Underfull \vbox (badness 10000) has occurred while \output is active [8]
Overfull \hbox (0.60022pt too wide) in paragraph at lines 352--352
[] /pcrr8t_at_8.0pt/<object type="Socket" os_level="-1" os_index="0" cpuset="0x
00000055"[]
[9 <./emmett.png>]
Overfull \hbox (19.80023pt too wide) in paragraph at lines 352--352
[] /pcrr8t_at_8.0pt/<object type="Core" os_level="-1" os_index="0" cpuset
="0x00000001"[]

Overfull \hbox (19.80023pt too wide) in paragraph at lines 352--352
[] /pcrr8t_at_8.0pt/<object type="PU" os_level="-1" os_index="0" cpuset
="0x00000001"[]

Overfull \hbox (19.80023pt too wide) in paragraph at lines 352--352
[] /pcrr8t_at_8.0pt/<object type="Core" os_level="-1" os_index="1" cpuset
="0x00000010"[]

Overfull \hbox (19.80023pt too wide) in paragraph at lines 352--352
[] /pcrr8t_at_8.0pt/<object type="PU" os_level="-1" os_index="4" cpuset
="0x00000010"[]

Underfull \vbox (badness 2478) has occurred while \output is active [10]
<ppc64-with-smt.pdf, id=106, 1154.3125pt x 431.6125pt>
<use ppc64-with-smt.pdf>
<ppc64-without-smt.pdf, id=107, 592.2125pt x 431.6125pt>
<use ppc64-without-smt.pdf>
Underfull \vbox (badness 10000) has occurred while \output is active [11 <./ppc
64-with-smt.pdf
Warning: /usr/bin/pdflatex (file ./ppc64-with-smt.pdf): pdf inclusion: Page Gro
up detected which pdfTeX can't handle. Ignoring it.
>] <ppc64-full-with-smt.pdf, id=126, 913.4125pt x 1355.0625pt>
<use ppc64-full-with-smt.pdf>
Underfull \vbox (badness 10000) has occurred while \output is active [12 <./ppc
64-without-smt.pdf
Warning: /usr/bin/pdflatex (file ./ppc64-without-smt.pdf): pdf inclusion: Page
Group detected which pdfTeX can't handle. Ignoring it.
>]
Underfull \vbox (badness 10000) has occurred while \output is active [13 <./ppc
64-full-with-smt.pdf
Warning: /usr/bin/pdflatex (file ./ppc64-full-with-smt.pdf): pdf inclusion: Pag
e Group detected which pdfTeX can't handle. Ignoring it.
>] [14]
Underfull \vbox (badness 10000) has occurred while \output is active [15]
Overfull \hbox (24.60023pt too wide) in paragraph at lines 567--567
[] /pcrr8t_at_8.0pt/printf("Couldn't bind to cpuset %s: %s\n", str, str
error(error));[]

Underfull \vbox (badness 10000) has occurred while \output is active [16]
[17]
Underfull \hbox (badness 10000) in paragraph at lines 623--624
/ptmr8t/Questions should be sent to the de-vel mail-ing list

Underfull \hbox (badness 10000) in paragraph at lines 623--624
/ptmr8t/([][]/pcrr8t/http://www.open-mpi.org/community/lists/hwloc.php[][]/ptmr
8t/).

Underfull \hbox (badness 10000) in paragraph at lines 623--624
/ptmr8t/Bug re-ports should be re-ported in the tracker

Underfull \hbox (badness 10000) in paragraph at lines 630--631
/ptmr8t/hwloc is the evo-lu-tion and merger of the libtopol-ogy

Underfull \hbox (badness 10000) in paragraph at lines 630--631
/ptmr8t/([][]/pcrr8t/http://runtime.bordeaux.inria.fr/libtopology/[][]/ptmr8t/)

Underfull \hbox (badness 10000) in paragraph at lines 630--631
/ptmr8t/project and the Portable Linux Pro-ces-sor Affin-ity (PLPA)

Underfull \hbox (badness 6592) in paragraph at lines 630--631
/ptmr8t/([][]/pcrr8t/http://www.open-mpi.org/projects/plpa/[][]/ptmr8t/) projec
t. Be-cause of

Underfull \hbox (badness 10000) in paragraph at lines 632--633
[]/ptmr8t/libtopology was ini-tially de-vel-oped by the IN-RIA Run-time Team-Pr
oject

Underfull \hbox (badness 3019) in paragraph at lines 632--633
/ptmr8t/([][]/pcrr8t/http://runtime.bordeaux.inria.fr/[][]/ptmr8t/) (headed by
Ray-mond Namyst

Underfull \vbox (badness 1824) has occurred while \output is active [18]
[19] [20] <diagram.pdf, id=206, 672.5125pt x 690.58pt> <use diagram.pdf>
Overfull \hbox (327.51085pt too wide) in paragraph at lines 689--689
 []

Underfull \vbox (badness 10000) has occurred while \output is active [21]
Overfull \vbox (175.74323pt too high) has occurred while \output is active
[22 <./diagram.pdf>] [23]
Underfull \hbox (badness 1924) in paragraph at lines 727--728
[]/ptmr8t/enforces the re-turn value of [][]hwloc_-topology_-is_-
[24]
Underfull \hbox (badness 2027) in paragraph at lines 733--734
[]/ptmr8t/relaxes dis-tance com-par-i-son dur-ing
[25] [26]
Underfull \hbox (badness 1303) in paragraph at lines 772--773
/ptmr8t/When I/O dis-cov-ery is en-abled and sup-ported, some ad-di-tional ob-j
ects (types

Underfull \hbox (badness 10000) in paragraph at lines 772--773
[][]/pcrr8t/HWLOC_-OBJ_-BRIDGE[][]/ptmr8t/, [][]/pcrr8t/HWLOC_-OBJ_-PCI_-DEVICE
[][] /ptmr8t/and [][]/pcrr8t/HWLOC_-OBJ_-OS_-
[27] [28]Error: PDF version 1.5 -- xpdf supports version 1.4 (continuing anyway)

Error: /usr/bin/pdflatex (file devel09-pci.pdf): pdf inclusion: found pdf versi
on <1.5>, but at most version <1.4> allowed
 ==> Fatal error occurred, the output PDF file is not finished!
This is makeindex, version 2.14 [02-Oct-2002] (kpathsea + Thai support).
Scanning input file letter-refman.idx...done (0 entries accepted, 0 rejected).
Nothing written in letter-refman.ind.
Transcript written in letter-refman.ilg.
This is pdfTeX, Version 3.14159-1.10b (Web2C 7.4.5)
(./letter-refman.tex{/usr/share/texmf/pdftex/config/pdftex.cfg}
LaTeX2e <2001/06/01>
Babel <v3.7h> and hyphenation patterns for american, french, german, ngerman, n
ohyphenation, loaded.
(/usr/share/texmf/tex/latex/base/book.cls
Document Class: book 2001/04/21 v1.4e Standard LaTeX document class
(/usr/share/texmf/tex/latex/base/bk10.clo))
(/usr/share/texmf/tex/latex/base/makeidx.sty)
(/usr/share/texmf/tex/latex/fancyhdr/fancyhdr.sty)
(/usr/share/texmf/tex/latex/graphics/graphicx.sty
(/usr/share/texmf/tex/latex/graphics/keyval.sty)
(/usr/share/texmf/tex/latex/graphics/graphics.sty
(/usr/share/texmf/tex/latex/graphics/trig.sty)
(/usr/share/texmf/tex/latex/config/graphics.cfg)
(/usr/share/texmf/tex/latex/graphics/pdftex.def)))
(/usr/share/texmf/tex/latex/tools/multicol.sty)
(/usr/share/texmf/tex/latex/misc/float.sty)
(/usr/share/texmf/tex/latex/base/textcomp.sty
(/usr/share/texmf/tex/latex/base/ts1enc.def))
(/usr/share/texmf/tex/latex/base/alltt.sty)
(/usr/share/texmf/tex/latex/psnfss/times.sty)
(/usr/share/texmf/tex/latex/hyperref/hyperref.sty
(/usr/share/texmf/tex/latex/hyperref/pd1enc.def)
(/usr/share/texmf/tex/latex/config/hyperref.cfg)
Implicit mode ON; LaTeX internals redefined
(/usr/share/texmf/tex/latex/hyperref/backref.sty)
(/usr/share/texmf/tex/latex/html/url.sty))
*hyperref using driver hpdftex*
(/usr/share/texmf/tex/latex/hyperref/hpdftex.def
(/usr/share/texmf/tex/latex/psnfss/pifont.sty
(/usr/share/texmf/tex/latex/psnfss/upzd.fd)
(/usr/share/texmf/tex/latex/psnfss/upsy.fd))) (./doxygen.sty
(/usr/share/texmf/tex/latex/tools/calc.sty)
(/usr/share/texmf/tex/latex/tools/array.sty))
(/usr/share/texmf/tex/latex/base/fontenc.sty
(/usr/share/texmf/tex/latex/base/t1enc.def))
Writing index file letter-refman.idx
(./letter-refman.aux) (/usr/share/texmf/tex/latex/base/ts1cmr.fd)
(/usr/share/texmf/tex/latex/psnfss/t1ptm.fd)
(/usr/share/texmf/tex/context/base/supp-pdf.tex
(/usr/share/texmf/tex/context/base/supp-mis.tex
loading : Context Support Macros / Missing
)
loading : Context Support Macros / PDF
) (/usr/share/texmf/tex/latex/graphics/color.sty
(/usr/share/texmf/tex/latex/config/color.cfg))
(/usr/share/texmf/tex/latex/hyperref/nameref.sty) (./letter-refman.out)
(./letter-refman.out) [1{/usr/share/texmf/dvips/config/pdftex.map}] [2]
(./letter-refman.toc)
! pdfTeX warning (ext4): destination with the same identifier (name{page.1}) ha
s been already used, duplicate ignored
<to be read again>
                   \penalty
l.44 \clearemptydoublepage
                           [1]
! pdfTeX warning (ext4): destination with the same identifier (name{page.2}) ha
s been already used, duplicate ignored
<to be read again>
                   \penalty
l.44 \clearemptydoublepage
                           [2]
Chapter 1.
(./index.tex (/usr/share/texmf/tex/latex/psnfss/ts1ptm.fd)
! pdfTeX warning (ext4): destination with the same identifier (name{page.1}) ha
s been already used, duplicate ignored
<to be read again>
                   \penalty
l.17 ...d support) \item Solaris \item AIX \item D
                                                  arwin / OS X \item Free\-B...
[1] (/usr/share/texmf/tex/latex/psnfss/t1pcr.fd)
! pdfTeX warning (ext4): destination with the same identifier (name{page.2}) ha
s been already used, duplicate ignored
<to be read again>
                   \penalty
l.44
      [2] <dudley.png, id=123, 451.6875pt x 572.1375pt> <use dudley.png>
Underfull \vbox (badness 1048) has occurred while \output is active [3]
[4 <./dudley.png>]
Overfull \hbox (10.20023pt too wide) in paragraph at lines 186--186
[] /pcrr8t_at_8.0pt/dmi_board_vendor="Dell Computer Corporation" dmi_board_na
me="0RD318"[]

Overfull \hbox (0.60022pt too wide) in paragraph at lines 186--186
[] /pcrr8t_at_8.0pt/<object type="Socket" os_level="-1" os_index="0" cpuset="0x
00001111"[]

Overfull \hbox (29.40024pt too wide) in paragraph at lines 186--186
[] /pcrr8t_at_8.0pt/<object type="Core" os_level="-1" os_index="0" cpus
et="0x00000101"[]

Overfull \hbox (29.40024pt too wide) in paragraph at lines 186--186
[] /pcrr8t_at_8.0pt/<object type="PU" os_level="-1" os_index="0" cpus
et="0x00000001"[]

Overfull \hbox (5.40022pt too wide) in paragraph at lines 186--186
[] /pcrr8t_at_8.0pt/complete_cpuset="0x00000001" online_cpuset="0
x00000001"[]

Overfull \hbox (29.40024pt too wide) in paragraph at lines 186--186
[] /pcrr8t_at_8.0pt/<object type="PU" os_level="-1" os_index="8" cpus
et="0x00000100"[]

Overfull \hbox (5.40022pt too wide) in paragraph at lines 186--186
[] /pcrr8t_at_8.0pt/complete_cpuset="0x00000100" online_cpuset="0
x00000100"[]
[5]
Overfull \hbox (29.40024pt too wide) in paragraph at lines 186--186
[] /pcrr8t_at_8.0pt/<object type="Core" os_level="-1" os_index="1" cpus
et="0x00001010"[]

Overfull \hbox (29.40024pt too wide) in paragraph at lines 186--186
[] /pcrr8t_at_8.0pt/<object type="PU" os_level="-1" os_index="4" cpus
et="0x00000010"[]

Overfull \hbox (5.40022pt too wide) in paragraph at lines 186--186
[] /pcrr8t_at_8.0pt/complete_cpuset="0x00000010" online_cpuset="0
x00000010"[]

Overfull \hbox (34.20024pt too wide) in paragraph at lines 186--186
[] /pcrr8t_at_8.0pt/<object type="PU" os_level="-1" os_index="12" cpu
set="0x00001000"[]

Overfull \hbox (5.40022pt too wide) in paragraph at lines 186--186
[] /pcrr8t_at_8.0pt/complete_cpuset="0x00001000" online_cpuset="0
x00001000"[]
<hagrid.png, id=142, 973.6375pt x 291.0875pt> <use hagrid.png>
Overfull \hbox (628.63512pt too wide) in paragraph at lines 194--194
 []

Underfull \vbox (badness 10000) has occurred while \output is active [6]
[7 <./hagrid.png>]
Overfull \hbox (10.20023pt too wide) in paragraph at lines 271--271
[] /pcrr8t_at_8.0pt/<object type="NUMANode" os_level="-1" os_index="0" cpuset="
0x00000003"[]

Overfull \hbox (10.20023pt too wide) in paragraph at lines 271--271
[] /pcrr8t_at_8.0pt/<object type="Socket" os_level="-1" os_index="0" cpuset="
0x00000003"[]

Overfull \hbox (0.60022pt too wide) in paragraph at lines 271--271
[] /pcrr8t_at_8.0pt/complete_nodeset="0x00000001" allowed_nodeset="0x
00000001"[]

Overfull \hbox (29.40024pt too wide) in paragraph at lines 271--271
[] /pcrr8t_at_8.0pt/<object type="PU" os_level="-1" os_index="0" cpus
et="0x00000001"[]

Overfull \hbox (5.40022pt too wide) in paragraph at lines 271--271
[] /pcrr8t_at_8.0pt/complete_cpuset="0x00000001" online_cpuset="0
x00000001"[]

Overfull \hbox (29.40024pt too wide) in paragraph at lines 271--271
[] /pcrr8t_at_8.0pt/complete_nodeset="0x00000001" allowed_nodeset
="0x00000001"/>[]
<emmett.png, id=152, 431.6125pt x 431.6125pt> <use emmett.png>
Underfull \vbox (badness 10000) has occurred while \output is active [8]
Overfull \hbox (0.60022pt too wide) in paragraph at lines 352--352
[] /pcrr8t_at_8.0pt/<object type="Socket" os_level="-1" os_index="0" cpuset="0x
00000055"[]
[9 <./emmett.png>]
Overfull \hbox (19.80023pt too wide) in paragraph at lines 352--352
[] /pcrr8t_at_8.0pt/<object type="Core" os_level="-1" os_index="0" cpuset
="0x00000001"[]

Overfull \hbox (19.80023pt too wide) in paragraph at lines 352--352
[] /pcrr8t_at_8.0pt/<object type="PU" os_level="-1" os_index="0" cpuset
="0x00000001"[]

Overfull \hbox (19.80023pt too wide) in paragraph at lines 352--352
[] /pcrr8t_at_8.0pt/<object type="Core" os_level="-1" os_index="1" cpuset
="0x00000010"[]

Overfull \hbox (19.80023pt too wide) in paragraph at lines 352--352
[] /pcrr8t_at_8.0pt/<object type="PU" os_level="-1" os_index="4" cpuset
="0x00000010"[]

Underfull \vbox (badness 2478) has occurred while \output is active [10]
<ppc64-with-smt.pdf, id=173, 1154.3125pt x 431.6125pt>
<use ppc64-with-smt.pdf>
<ppc64-without-smt.pdf, id=174, 592.2125pt x 431.6125pt>
<use ppc64-without-smt.pdf>
Underfull \vbox (badness 10000) has occurred while \output is active [11 <./ppc
64-with-smt.pdf
Warning: /usr/bin/pdflatex (file ./ppc64-with-smt.pdf): pdf inclusion: Page Gro
up detected which pdfTeX can't handle. Ignoring it.
>] <ppc64-full-with-smt.pdf, id=193, 913.4125pt x 1355.0625pt>
<use ppc64-full-with-smt.pdf>
Underfull \vbox (badness 10000) has occurred while \output is active [12 <./ppc
64-without-smt.pdf
Warning: /usr/bin/pdflatex (file ./ppc64-without-smt.pdf): pdf inclusion: Page
Group detected which pdfTeX can't handle. Ignoring it.
>]
Underfull \vbox (badness 10000) has occurred while \output is active [13 <./ppc
64-full-with-smt.pdf
Warning: /usr/bin/pdflatex (file ./ppc64-full-with-smt.pdf): pdf inclusion: Pag
e Group detected which pdfTeX can't handle. Ignoring it.
>] [14]
Underfull \vbox (badness 10000) has occurred while \output is active [15]
Overfull \hbox (24.60023pt too wide) in paragraph at lines 567--567
[] /pcrr8t_at_8.0pt/printf("Couldn't bind to cpuset %s: %s\n", str, str
error(error));[]

Underfull \vbox (badness 10000) has occurred while \output is active [16]
[17]
Underfull \hbox (badness 10000) in paragraph at lines 623--624
/ptmr8t/Questions should be sent to the de-vel mail-ing list

Underfull \hbox (badness 10000) in paragraph at lines 623--624
/ptmr8t/([][]/pcrr8t/http://www.open-mpi.org/community/lists/hwloc.php[][]/ptmr
8t/).

Underfull \hbox (badness 10000) in paragraph at lines 623--624
/ptmr8t/Bug re-ports should be re-ported in the tracker

Underfull \hbox (badness 10000) in paragraph at lines 630--631
/ptmr8t/hwloc is the evo-lu-tion and merger of the libtopol-ogy

Underfull \hbox (badness 10000) in paragraph at lines 630--631
/ptmr8t/([][]/pcrr8t/http://runtime.bordeaux.inria.fr/libtopology/[][]/ptmr8t/)

Underfull \hbox (badness 10000) in paragraph at lines 630--631
/ptmr8t/project and the Portable Linux Pro-ces-sor Affin-ity (PLPA)

Underfull \hbox (badness 6592) in paragraph at lines 630--631
/ptmr8t/([][]/pcrr8t/http://www.open-mpi.org/projects/plpa/[][]/ptmr8t/) projec
t. Be-cause of

Underfull \hbox (badness 10000) in paragraph at lines 632--633
[]/ptmr8t/libtopology was ini-tially de-vel-oped by the IN-RIA Run-time Team-Pr
oject

Underfull \hbox (badness 3019) in paragraph at lines 632--633
/ptmr8t/([][]/pcrr8t/http://runtime.bordeaux.inria.fr/[][]/ptmr8t/) (headed by
Ray-mond Namyst

Underfull \vbox (badness 1824) has occurred while \output is active [18]
[19] [20] <diagram.pdf, id=270, 672.5125pt x 690.58pt> <use diagram.pdf>
Overfull \hbox (327.51085pt too wide) in paragraph at lines 689--689
 []

Underfull \vbox (badness 10000) has occurred while \output is active [21]
Overfull \vbox (175.74323pt too high) has occurred while \output is active
[22 <./diagram.pdf>] [23]
Underfull \hbox (badness 1924) in paragraph at lines 727--728
[]/ptmr8t/enforces the re-turn value of [][]hwloc_-topology_-is_-
[24]
Underfull \hbox (badness 2027) in paragraph at lines 733--734
[]/ptmr8t/relaxes dis-tance com-par-i-son dur-ing
[25] [26]
Underfull \hbox (badness 1303) in paragraph at lines 772--773
/ptmr8t/When I/O dis-cov-ery is en-abled and sup-ported, some ad-di-tional ob-j
ects (types

Underfull \hbox (badness 10000) in paragraph at lines 772--773
[][]/pcrr8t/HWLOC_-OBJ_-BRIDGE[][]/ptmr8t/, [][]/pcrr8t/HWLOC_-OBJ_-PCI_-DEVICE
[][] /ptmr8t/and [][]/pcrr8t/HWLOC_-OBJ_-OS_-
[27] [28]Error: PDF version 1.5 -- xpdf supports version 1.4 (continuing anyway)

Error: /usr/bin/pdflatex (file devel09-pci.pdf): pdf inclusion: found pdf versi
on <1.5>, but at most version <1.4> allowed
 ==> Fatal error occurred, the output PDF file is not finished!
cd doxygen-doc/latex; \
rm -f *.aux *.toc *.idx *.ind *.ilg *.log *.out; \
cp refman.tex a4-refman.tex; \
/usr/bin/pdflatex a4-refman.tex; \
/usr/bin/makeindex a4-refman.idx; \
/usr/bin/pdflatex a4-refman.tex; \
done=0; repeat=5; \
while test $done = 0 -a $repeat -gt 0; do \
           if /bin/grep -E 'Rerun (LaTeX|to get cross-references right)' a4-refman.log > /dev/null 2>&1; then \
       /usr/bin/pdflatex a4-refman.tex; \
       repeat=`expr $repeat - 1`; \
   else \
       done=1; \
   fi; \
done; \
mv a4-refman.pdf /home/mpiteam/hwloc/nightly-tarball-build-root/trunk/create-r3680/hwloc/doc/doxygen-doc/hwloc-a4.pdf
This is pdfTeX, Version 3.14159-1.10b (Web2C 7.4.5)
(./a4-refman.tex{/usr/share/texmf/pdftex/config/pdftex.cfg}
LaTeX2e <2001/06/01>
Babel <v3.7h> and hyphenation patterns for american, french, german, ngerman, n
ohyphenation, loaded.
(/usr/share/texmf/tex/latex/base/book.cls
Document Class: book 2001/04/21 v1.4e Standard LaTeX document class
(/usr/share/texmf/tex/latex/base/bk10.clo))
(/usr/share/texmf/tex/latex/misc/a4wide.sty
(/usr/share/texmf/tex/latex/ntgclass/a4.sty))
(/usr/share/texmf/tex/latex/base/makeidx.sty)
(/usr/share/texmf/tex/latex/fancyhdr/fancyhdr.sty)
(/usr/share/texmf/tex/latex/graphics/graphicx.sty
(/usr/share/texmf/tex/latex/graphics/keyval.sty)
(/usr/share/texmf/tex/latex/graphics/graphics.sty
(/usr/share/texmf/tex/latex/graphics/trig.sty)
(/usr/share/texmf/tex/latex/config/graphics.cfg)
(/usr/share/texmf/tex/latex/graphics/pdftex.def)))
(/usr/share/texmf/tex/latex/tools/multicol.sty)
(/usr/share/texmf/tex/latex/misc/float.sty)
(/usr/share/texmf/tex/latex/base/textcomp.sty
(/usr/share/texmf/tex/latex/base/ts1enc.def))
(/usr/share/texmf/tex/latex/base/alltt.sty)
(/usr/share/texmf/tex/latex/psnfss/times.sty)
(/usr/share/texmf/tex/latex/hyperref/hyperref.sty
(/usr/share/texmf/tex/latex/hyperref/pd1enc.def)
(/usr/share/texmf/tex/latex/config/hyperref.cfg)
Implicit mode ON; LaTeX internals redefined
(/usr/share/texmf/tex/latex/hyperref/backref.sty)
(/usr/share/texmf/tex/latex/html/url.sty))
*hyperref using driver hpdftex*
(/usr/share/texmf/tex/latex/hyperref/hpdftex.def
(/usr/share/texmf/tex/latex/psnfss/pifont.sty
(/usr/share/texmf/tex/latex/psnfss/upzd.fd)
(/usr/share/texmf/tex/latex/psnfss/upsy.fd))) (./doxygen.sty
(/usr/share/texmf/tex/latex/tools/calc.sty)
(/usr/share/texmf/tex/latex/tools/array.sty))
(/usr/share/texmf/tex/latex/base/fontenc.sty
(/usr/share/texmf/tex/latex/base/t1enc.def))
Writing index file a4-refman.idx
No file a4-refman.aux.
(/usr/share/texmf/tex/latex/base/ts1cmr.fd)
(/usr/share/texmf/tex/latex/psnfss/t1ptm.fd)
(/usr/share/texmf/tex/context/base/supp-pdf.tex
(/usr/share/texmf/tex/context/base/supp-mis.tex
loading : Context Support Macros / Missing
)
loading : Context Support Macros / PDF
) (/usr/share/texmf/tex/latex/graphics/color.sty
(/usr/share/texmf/tex/latex/config/color.cfg))
(/usr/share/texmf/tex/latex/hyperref/nameref.sty) [1{/usr/share/texmf/dvips/con
fig/pdftex.map}] [2]
! pdfTeX warning (ext4): destination with the same identifier (name{page.1}) ha
s been already used, duplicate ignored
<to be read again>
                   \penalty
l.44 \clearemptydoublepage
                           [1]
! pdfTeX warning (ext4): destination with the same identifier (name{page.2}) ha
s been already used, duplicate ignored
<to be read again>
                   \penalty
l.44 \clearemptydoublepage
                           [2]
Chapter 1.
(./index.tex
Underfull \hbox (badness 10000) in paragraph at lines 1--1
[]/ptmb8t_at_14.4pt/Portable ab-strac-tion of hi-er-ar-chi-cal ar-chi-tec-tures fo
r high-
(/usr/share/texmf/tex/latex/psnfss/ts1ptm.fd)
! pdfTeX warning (ext4): destination with the same identifier (name{page.1}) ha
s been already used, duplicate ignored
<to be read again>
                   \penalty
l.21
      [1] (/usr/share/texmf/tex/latex/psnfss/t1pcr.fd)
! pdfTeX warning (ext4): destination with the same identifier (name{page.2}) ha
s been already used, duplicate ignored
<to be read again>
                   \penalty
l.70
      [2] <dudley.png, id=59, 451.6875pt x 572.1375pt> <use dudley.png>
[3 <./dudley.png>] [4] <hagrid.png, id=70, 973.6375pt x 291.0875pt>
<use hagrid.png>
Overfull \hbox (549.04887pt too wide) in paragraph at lines 194--194
 []
[5 <./hagrid.png>] <emmett.png, id=76, 431.6125pt x 431.6125pt>
<use emmett.png>
Underfull \vbox (badness 10000) has occurred while \output is active [6]
[7 <./emmett.png>] [8] <ppc64-with-smt.pdf, id=100, 1154.3125pt x 431.6125pt>
<use ppc64-with-smt.pdf>
<ppc64-without-smt.pdf, id=101, 592.2125pt x 431.6125pt>
<use ppc64-without-smt.pdf>
Underfull \vbox (badness 10000) has occurred while \output is active [9 <./ppc6
4-with-smt.pdf
Warning: /usr/bin/pdflatex (file ./ppc64-with-smt.pdf): pdf inclusion: Page Gro
up detected which pdfTeX can't handle. Ignoring it.
> <./ppc64-without-smt.pdf
Warning: /usr/bin/pdflatex (file ./ppc64-without-smt.pdf): pdf inclusion: Page
Group detected which pdfTeX can't handle. Ignoring it.
>] <ppc64-full-with-smt.pdf, id=127, 913.4125pt x 1355.0625pt>
<use ppc64-full-with-smt.pdf>
Underfull \vbox (badness 10000) has occurred while \output is active [10]
Underfull \vbox (badness 10000) has occurred while \output is active [11 <./ppc
64-full-with-smt.pdf
Warning: /usr/bin/pdflatex (file ./ppc64-full-with-smt.pdf): pdf inclusion: Pag
e Group detected which pdfTeX can't handle. Ignoring it.
>] [12]
Underfull \vbox (badness 10000) has occurred while \output is active [13]
[14]
Overfull \hbox (71.9415pt too wide) in paragraph at lines 623--624
/ptmr8t/Questions should be sent to the de-vel mail-ing list ([][]/pcrr8t/http:
//www.open-mpi.org/community/lists/hwloc.php[][]/ptmr8t/).

Overfull \hbox (59.08203pt too wide) in paragraph at lines 630--631
/ptmr8t/hwloc is the evo-lu-tion and merger of the libtopol-ogy ([][]/pcrr8t/ht
tp://runtime.bordeaux.inria.fr/libtopology/[][]/ptmr8t/)

Overfull \hbox (37.41107pt too wide) in paragraph at lines 630--631
/ptmr8t/project and the Portable Linux Pro-ces-sor Affin-ity (PLPA) ([][]/pcrr8
t/http://www.open-mpi.org/projects/plpa/[][]/ptmr8t/)

Underfull \hbox (badness 10000) in paragraph at lines 632--633
[]/ptmr8t/libtopology was ini-tially de-vel-oped by the IN-RIA Run-time Team-Pr
oject

Underfull \hbox (badness 10000) in paragraph at lines 632--633
/ptmr8t/([][]/pcrr8t/http://runtime.bordeaux.inria.fr/[][]/ptmr8t/) (headed by
Ray-mond Namyst

Underfull \hbox (badness 2035) in paragraph at lines 632--633
/ptmr8t/([][]/pcrr8t/http://dept-info.labri.fr/$/cmsy10/^^X$/pcrr8t/namyst/[][]
/ptmr8t/). PLPA was ini-tially de-vel-oped by the Open
[15] [16] <diagram.pdf, id=188, 672.5125pt x 690.58pt> <use diagram.pdf>
Overfull \hbox (247.9246pt too wide) in paragraph at lines 689--689
 []

Underfull \vbox (badness 10000) has occurred while \output is active [17]
Overfull \vbox (79.74323pt too high) has occurred while \output is active
[18 <./diagram.pdf>] [19] [20] [21] [22]Error: PDF version 1.5 -- xpdf supports version 1.4 (continuing anyway)

Error: /usr/bin/pdflatex (file devel09-pci.pdf): pdf inclusion: found pdf versi
on <1.5>, but at most version <1.4> allowed
 ==> Fatal error occurred, the output PDF file is not finished!
This is makeindex, version 2.14 [02-Oct-2002] (kpathsea + Thai support).
Scanning input file a4-refman.idx...done (0 entries accepted, 0 rejected).
Nothing written in a4-refman.ind.
Transcript written in a4-refman.ilg.
This is pdfTeX, Version 3.14159-1.10b (Web2C 7.4.5)
(./a4-refman.tex{/usr/share/texmf/pdftex/config/pdftex.cfg}
LaTeX2e <2001/06/01>
Babel <v3.7h> and hyphenation patterns for american, french, german, ngerman, n
ohyphenation, loaded.
(/usr/share/texmf/tex/latex/base/book.cls
Document Class: book 2001/04/21 v1.4e Standard LaTeX document class
(/usr/share/texmf/tex/latex/base/bk10.clo))
(/usr/share/texmf/tex/latex/misc/a4wide.sty
(/usr/share/texmf/tex/latex/ntgclass/a4.sty))
(/usr/share/texmf/tex/latex/base/makeidx.sty)
(/usr/share/texmf/tex/latex/fancyhdr/fancyhdr.sty)
(/usr/share/texmf/tex/latex/graphics/graphicx.sty
(/usr/share/texmf/tex/latex/graphics/keyval.sty)
(/usr/share/texmf/tex/latex/graphics/graphics.sty
(/usr/share/texmf/tex/latex/graphics/trig.sty)
(/usr/share/texmf/tex/latex/config/graphics.cfg)
(/usr/share/texmf/tex/latex/graphics/pdftex.def)))
(/usr/share/texmf/tex/latex/tools/multicol.sty)
(/usr/share/texmf/tex/latex/misc/float.sty)
(/usr/share/texmf/tex/latex/base/textcomp.sty
(/usr/share/texmf/tex/latex/base/ts1enc.def))
(/usr/share/texmf/tex/latex/base/alltt.sty)
(/usr/share/texmf/tex/latex/psnfss/times.sty)
(/usr/share/texmf/tex/latex/hyperref/hyperref.sty
(/usr/share/texmf/tex/latex/hyperref/pd1enc.def)
(/usr/share/texmf/tex/latex/config/hyperref.cfg)
Implicit mode ON; LaTeX internals redefined
(/usr/share/texmf/tex/latex/hyperref/backref.sty)
(/usr/share/texmf/tex/latex/html/url.sty))
*hyperref using driver hpdftex*
(/usr/share/texmf/tex/latex/hyperref/hpdftex.def
(/usr/share/texmf/tex/latex/psnfss/pifont.sty
(/usr/share/texmf/tex/latex/psnfss/upzd.fd)
(/usr/share/texmf/tex/latex/psnfss/upsy.fd))) (./doxygen.sty
(/usr/share/texmf/tex/latex/tools/calc.sty)
(/usr/share/texmf/tex/latex/tools/array.sty))
(/usr/share/texmf/tex/latex/base/fontenc.sty
(/usr/share/texmf/tex/latex/base/t1enc.def))
Writing index file a4-refman.idx
(./a4-refman.aux) (/usr/share/texmf/tex/latex/base/ts1cmr.fd)
(/usr/share/texmf/tex/latex/psnfss/t1ptm.fd)
(/usr/share/texmf/tex/context/base/supp-pdf.tex
(/usr/share/texmf/tex/context/base/supp-mis.tex
loading : Context Support Macros / Missing
)
loading : Context Support Macros / PDF
) (/usr/share/texmf/tex/latex/graphics/color.sty
(/usr/share/texmf/tex/latex/config/color.cfg))
(/usr/share/texmf/tex/latex/hyperref/nameref.sty) (./a4-refman.out)
(./a4-refman.out) [1{/usr/share/texmf/dvips/config/pdftex.map}] [2]
(./a4-refman.toc)
! pdfTeX warning (ext4): destination with the same identifier (name{page.1}) ha
s been already used, duplicate ignored
<to be read again>
                   \penalty
l.44 \clearemptydoublepage
                           [1]
! pdfTeX warning (ext4): destination with the same identifier (name{page.2}) ha
s been already used, duplicate ignored
<to be read again>
                   \penalty
l.44 \clearemptydoublepage
                           [2]
Chapter 1.
(./index.tex
Underfull \hbox (badness 10000) in paragraph at lines 1--1
[]/ptmb8t_at_14.4pt/Portable ab-strac-tion of hi-er-ar-chi-cal ar-chi-tec-tures fo
r high-
(/usr/share/texmf/tex/latex/psnfss/ts1ptm.fd)
! pdfTeX warning (ext4): destination with the same identifier (name{page.1}) ha
s been already used, duplicate ignored
<to be read again>
                   \penalty
l.21
      [1] (/usr/share/texmf/tex/latex/psnfss/t1pcr.fd)
! pdfTeX warning (ext4): destination with the same identifier (name{page.2}) ha
s been already used, duplicate ignored
<to be read again>
                   \penalty
l.70
      [2] <dudley.png, id=120, 451.6875pt x 572.1375pt> <use dudley.png>
[3 <./dudley.png>] [4] <hagrid.png, id=130, 973.6375pt x 291.0875pt>
<use hagrid.png>
Overfull \hbox (549.04887pt too wide) in paragraph at lines 194--194
 []
[5 <./hagrid.png>] <emmett.png, id=136, 431.6125pt x 431.6125pt>
<use emmett.png>
Underfull \vbox (badness 10000) has occurred while \output is active [6]
[7 <./emmett.png>] [8] <ppc64-with-smt.pdf, id=159, 1154.3125pt x 431.6125pt>
<use ppc64-with-smt.pdf>
<ppc64-without-smt.pdf, id=160, 592.2125pt x 431.6125pt>
<use ppc64-without-smt.pdf>
Underfull \vbox (badness 10000) has occurred while \output is active [9 <./ppc6
4-with-smt.pdf
Warning: /usr/bin/pdflatex (file ./ppc64-with-smt.pdf): pdf inclusion: Page Gro
up detected which pdfTeX can't handle. Ignoring it.
> <./ppc64-without-smt.pdf
Warning: /usr/bin/pdflatex (file ./ppc64-without-smt.pdf): pdf inclusion: Page
Group detected which pdfTeX can't handle. Ignoring it.
>] <ppc64-full-with-smt.pdf, id=186, 913.4125pt x 1355.0625pt>
<use ppc64-full-with-smt.pdf>
Underfull \vbox (badness 10000) has occurred while \output is active [10]
Underfull \vbox (badness 10000) has occurred while \output is active [11 <./ppc
64-full-with-smt.pdf
Warning: /usr/bin/pdflatex (file ./ppc64-full-with-smt.pdf): pdf inclusion: Pag
e Group detected which pdfTeX can't handle. Ignoring it.
>] [12]
Underfull \vbox (badness 10000) has occurred while \output is active [13]
[14]
Overfull \hbox (71.9415pt too wide) in paragraph at lines 623--624
/ptmr8t/Questions should be sent to the de-vel mail-ing list ([][]/pcrr8t/http:
//www.open-mpi.org/community/lists/hwloc.php[][]/ptmr8t/).

Overfull \hbox (59.08203pt too wide) in paragraph at lines 630--631
/ptmr8t/hwloc is the evo-lu-tion and merger of the libtopol-ogy ([][]/pcrr8t/ht
tp://runtime.bordeaux.inria.fr/libtopology/[][]/ptmr8t/)

Overfull \hbox (37.41107pt too wide) in paragraph at lines 630--631
/ptmr8t/project and the Portable Linux Pro-ces-sor Affin-ity (PLPA) ([][]/pcrr8
t/http://www.open-mpi.org/projects/plpa/[][]/ptmr8t/)

Underfull \hbox (badness 10000) in paragraph at lines 632--633
[]/ptmr8t/libtopology was ini-tially de-vel-oped by the IN-RIA Run-time Team-Pr
oject

Underfull \hbox (badness 10000) in paragraph at lines 632--633
/ptmr8t/([][]/pcrr8t/http://runtime.bordeaux.inria.fr/[][]/ptmr8t/) (headed by
Ray-mond Namyst

Underfull \hbox (badness 2035) in paragraph at lines 632--633
/ptmr8t/([][]/pcrr8t/http://dept-info.labri.fr/$/cmsy10/^^X$/pcrr8t/namyst/[][]
/ptmr8t/). PLPA was ini-tially de-vel-oped by the Open
[15] [16] <diagram.pdf, id=244, 672.5125pt x 690.58pt> <use diagram.pdf>
Overfull \hbox (247.9246pt too wide) in paragraph at lines 689--689
 []

Underfull \vbox (badness 10000) has occurred while \output is active [17]
Overfull \vbox (79.74323pt too high) has occurred while \output is active
[18 <./diagram.pdf>] [19] [20] [21] [22]Error: PDF version 1.5 -- xpdf supports version 1.4 (continuing anyway)

Error: /usr/bin/pdflatex (file devel09-pci.pdf): pdf inclusion: found pdf versi
on <1.5>, but at most version <1.4> allowed
 ==> Fatal error occurred, the output PDF file is not finished!
make[1]: Leaving directory `/home/mpiteam/hwloc/nightly-tarball-build-root/trunk/create-r3680/hwloc/doc'
make \
  top_distdir="hwloc-1.4a1r3680" distdir="hwloc-1.4a1r3680" \
  dist-hook
make[1]: Entering directory `/home/mpiteam/hwloc/nightly-tarball-build-root/trunk/create-r3680/hwloc'
csh "./config/distscript.csh" "." "hwloc-1.4a1r3680" "1.4a1r3680" ""
 
Creating hwloc distribution
In directory: /home/mpiteam/hwloc/nightly-tarball-build-root/trunk/create-r3680/hwloc
Srcdir: /home/mpiteam/hwloc/nightly-tarball-build-root/trunk/create-r3680/hwloc
Builddir: /home/mpiteam/hwloc/nightly-tarball-build-root/trunk/create-r3680/hwloc
VPATH: no
Version: 1.4a1r3680
Started: Thu Aug 25 21:01:59 EDT 2011
 
*** Did NOT update VERSION file with repo rev number
*** Making new doxygen documentation (doxygen-doc tree)
*** Directory: srcdir: /home/mpiteam/hwloc/nightly-tarball-build-root/trunk/create-r3680/hwloc, distdir: /home/mpiteam/hwloc/nightly-tarball-build-root/trunk/create-r3680/hwloc/hwloc-1.4a1r3680, pwd: /home/mpiteam/hwloc/nightly-tarball-build-root/trunk/create-r3680/hwloc
make[2]: Entering directory `/home/mpiteam/hwloc/nightly-tarball-build-root/trunk/create-r3680/hwloc/doc'
make all-am
make[3]: Entering directory `/home/mpiteam/hwloc/nightly-tarball-build-root/trunk/create-r3680/hwloc/doc'
rm -fr doxygen-doc
/usr/bin/doxygen /home/mpiteam/hwloc/nightly-tarball-build-root/trunk/create-r3680/hwloc/doc/doxygen.cfg
Warning: ignoring unsupported tag `DOXYFILE_ENCODING =' at line 39, file /home/mpiteam/hwloc/nightly-tarball-build-root/trunk/create-r3680/hwloc/doc/doxygen.cfg
Warning: ignoring unsupported tag `QT_AUTOBRIEF =' at line 165, file /home/mpiteam/hwloc/nightly-tarball-build-root/trunk/create-r3680/hwloc/doc/doxygen.cfg
Warning: ignoring unsupported tag `SEPARATE_MEMBER_PAGES =' at line 185, file /home/mpiteam/hwloc/nightly-tarball-build-root/trunk/create-r3680/hwloc/doc/doxygen.cfg
Warning: ignoring unsupported tag `OPTIMIZE_FOR_FORTRAN =' at line 219, file /home/mpiteam/hwloc/nightly-tarball-build-root/trunk/create-r3680/hwloc/doc/doxygen.cfg
Warning: ignoring unsupported tag `OPTIMIZE_OUTPUT_VHDL =' at line 225, file /home/mpiteam/hwloc/nightly-tarball-build-root/trunk/create-r3680/hwloc/doc/doxygen.cfg
Warning: ignoring unsupported tag `EXTENSION_MAPPING =' at line 236, file /home/mpiteam/hwloc/nightly-tarball-build-root/trunk/create-r3680/hwloc/doc/doxygen.cfg
Warning: ignoring unsupported tag `BUILTIN_STL_SUPPORT =' at line 245, file /home/mpiteam/hwloc/nightly-tarball-build-root/trunk/create-r3680/hwloc/doc/doxygen.cfg
Warning: ignoring unsupported tag `CPP_CLI_SUPPORT =' at line 250, file /home/mpiteam/hwloc/nightly-tarball-build-root/trunk/create-r3680/hwloc/doc/doxygen.cfg
Warning: ignoring unsupported tag `SIP_SUPPORT =' at line 256, file /home/mpiteam/hwloc/nightly-tarball-build-root/trunk/create-r3680/hwloc/doc/doxygen.cfg
Warning: ignoring unsupported tag `IDL_PROPERTY_SUPPORT =' at line 265, file /home/mpiteam/hwloc/nightly-tarball-build-root/trunk/create-r3680/hwloc/doc/doxygen.cfg
Warning: ignoring unsupported tag `TYPEDEF_HIDES_STRUCT =' at line 290, file /home/mpiteam/hwloc/nightly-tarball-build-root/trunk/create-r3680/hwloc/doc/doxygen.cfg
Warning: ignoring unsupported tag `SYMBOL_CACHE_SIZE =' at line 306, file /home/mpiteam/hwloc/nightly-tarball-build-root/trunk/create-r3680/hwloc/doc/doxygen.cfg
Warning: ignoring unsupported tag `EXTRACT_ANON_NSPACES =' at line 348, file /home/mpiteam/hwloc/nightly-tarball-build-root/trunk/create-r3680/hwloc/doc/doxygen.cfg
Warning: ignoring unsupported tag `SORT_GROUP_NAMES =' at line 429, file /home/mpiteam/hwloc/nightly-tarball-build-root/trunk/create-r3680/hwloc/doc/doxygen.cfg
Warning: ignoring unsupported tag `SHOW_FILES =' at line 496, file /home/mpiteam/hwloc/nightly-tarball-build-root/trunk/create-r3680/hwloc/doc/doxygen.cfg
Warning: ignoring unsupported tag `SHOW_NAMESPACES =' at line 503, file /home/mpiteam/hwloc/nightly-tarball-build-root/trunk/create-r3680/hwloc/doc/doxygen.cfg
Warning: ignoring unsupported tag `FILE_VERSION_FILTER =' at line 513, file /home/mpiteam/hwloc/nightly-tarball-build-root/trunk/create-r3680/hwloc/doc/doxygen.cfg
Warning: ignoring unsupported tag `LAYOUT_FILE =' at line 522, file /home/mpiteam/hwloc/nightly-tarball-build-root/trunk/create-r3680/hwloc/doc/doxygen.cfg
Warning: ignoring unsupported tag `WARN_NO_PARAMDOC =' at line 558, file /home/mpiteam/hwloc/nightly-tarball-build-root/trunk/create-r3680/hwloc/doc/doxygen.cfg
Warning: ignoring unsupported tag `INPUT_ENCODING =' at line 593, file /home/mpiteam/hwloc/nightly-tarball-build-root/trunk/create-r3680/hwloc/doc/doxygen.cfg
Warning: ignoring unsupported tag `EXCLUDE_SYMBOLS =' at line 636, file /home/mpiteam/hwloc/nightly-tarball-build-root/trunk/create-r3680/hwloc/doc/doxygen.cfg
Warning: ignoring unsupported tag `REFERENCES_LINK_SOURCE =' at line 734, file /home/mpiteam/hwloc/nightly-tarball-build-root/trunk/create-r3680/hwloc/doc/doxygen.cfg
Warning: ignoring unsupported tag `USE_HTAGS =' at line 742, file /home/mpiteam/hwloc/nightly-tarball-build-root/trunk/create-r3680/hwloc/doc/doxygen.cfg
Warning: ignoring unsupported tag `HTML_DYNAMIC_SECTIONS =' at line 827, file /home/mpiteam/hwloc/nightly-tarball-build-root/trunk/create-r3680/hwloc/doc/doxygen.cfg
Warning: ignoring unsupported tag `GENERATE_DOCSET =' at line 839, file /home/mpiteam/hwloc/nightly-tarball-build-root/trunk/create-r3680/hwloc/doc/doxygen.cfg
Warning: ignoring unsupported tag `DOCSET_FEEDNAME =' at line 846, file /home/mpiteam/hwloc/nightly-tarball-build-root/trunk/create-r3680/hwloc/doc/doxygen.cfg
Warning: ignoring unsupported tag `DOCSET_BUNDLE_ID =' at line 853, file /home/mpiteam/hwloc/nightly-tarball-build-root/trunk/create-r3680/hwloc/doc/doxygen.cfg
Warning: ignoring unsupported tag `CHM_INDEX_ENCODING =' at line 886, file /home/mpiteam/hwloc/nightly-tarball-build-root/trunk/create-r3680/hwloc/doc/doxygen.cfg
Warning: ignoring unsupported tag `GENERATE_QHP =' at line 904, file /home/mpiteam/hwloc/nightly-tarball-build-root/trunk/create-r3680/hwloc/doc/doxygen.cfg
Warning: ignoring unsupported tag `QCH_FILE =' at line 910, file /home/mpiteam/hwloc/nightly-tarball-build-root/trunk/create-r3680/hwloc/doc/doxygen.cfg
Warning: ignoring unsupported tag `QHP_NAMESPACE =' at line 916, file /home/mpiteam/hwloc/nightly-tarball-build-root/trunk/create-r3680/hwloc/doc/doxygen.cfg
Warning: ignoring unsupported tag `QHP_VIRTUAL_FOLDER =' at line 922, file /home/mpiteam/hwloc/nightly-tarball-build-root/trunk/create-r3680/hwloc/doc/doxygen.cfg
Warning: ignoring unsupported tag `QHP_CUST_FILTER_NAME =' at line 928, file /home/mpiteam/hwloc/nightly-tarball-build-root/trunk/create-r3680/hwloc/doc/doxygen.cfg
Warning: ignoring unsupported tag `QHP_CUST_FILTER_ATTRS =' at line 933, file /home/mpiteam/hwloc/nightly-tarball-build-root/trunk/create-r3680/hwloc/doc/doxygen.cfg
Warning: ignoring unsupported tag `QHP_SECT_FILTER_ATTRS =' at line 939, file /home/mpiteam/hwloc/nightly-tarball-build-root/trunk/create-r3680/hwloc/doc/doxygen.cfg
Warning: ignoring unsupported tag `QHG_LOCATION =' at line 946, file /home/mpiteam/hwloc/nightly-tarball-build-root/trunk/create-r3680/hwloc/doc/doxygen.cfg
Warning: ignoring unsupported tag `FORMULA_FONTSIZE =' at line 988, file /home/mpiteam/hwloc/nightly-tarball-build-root/trunk/create-r3680/hwloc/doc/doxygen.cfg
Warning: ignoring unsupported tag `LATEX_SOURCE_CODE =' at line 1068, file /home/mpiteam/hwloc/nightly-tarball-build-root/trunk/create-r3680/hwloc/doc/doxygen.cfg
Warning: ignoring unsupported tag `MSCGEN_PATH =' at line 1354, file /home/mpiteam/hwloc/nightly-tarball-build-root/trunk/create-r3680/hwloc/doc/doxygen.cfg
Warning: ignoring unsupported tag `DOT_FONTNAME =' at line 1378, file /home/mpiteam/hwloc/nightly-tarball-build-root/trunk/create-r3680/hwloc/doc/doxygen.cfg
Warning: ignoring unsupported tag `DOT_FONTSIZE =' at line 1383, file /home/mpiteam/hwloc/nightly-tarball-build-root/trunk/create-r3680/hwloc/doc/doxygen.cfg
Warning: ignoring unsupported tag `DOT_FONTPATH =' at line 1390, file /home/mpiteam/hwloc/nightly-tarball-build-root/trunk/create-r3680/hwloc/doc/doxygen.cfg
Warning: ignoring unsupported tag `GROUP_GRAPHS =' at line 1409, file /home/mpiteam/hwloc/nightly-tarball-build-root/trunk/create-r3680/hwloc/doc/doxygen.cfg
Warning: ignoring unsupported tag `CALLER_GRAPH =' at line 1450, file /home/mpiteam/hwloc/nightly-tarball-build-root/trunk/create-r3680/hwloc/doc/doxygen.cfg
Warning: ignoring unsupported tag `DIRECTORY_GRAPH =' at line 1462, file /home/mpiteam/hwloc/nightly-tarball-build-root/trunk/create-r3680/hwloc/doc/doxygen.cfg
Warning: ignoring unsupported tag `DOT_GRAPH_MAX_NODES =' at line 1489, file /home/mpiteam/hwloc/nightly-tarball-build-root/trunk/create-r3680/hwloc/doc/doxygen.cfg
Warning: ignoring unsupported tag `DOT_TRANSPARENT =' at line 1507, file /home/mpiteam/hwloc/nightly-tarball-build-root/trunk/create-r3680/hwloc/doc/doxygen.cfg
Warning: ignoring unsupported tag `DOT_MULTI_TARGETS =' at line 1514, file /home/mpiteam/hwloc/nightly-tarball-build-root/trunk/create-r3680/hwloc/doc/doxygen.cfg
Warning: argument `NONE' for option GENERATE_TREEVIEW is not a valid boolean value
Using the default: NO!
Notice: Output directory `../doc/doxygen-doc' does not exist. I have created it for you.
/home/mpiteam/hwloc/nightly-tarball-build-root/trunk/create-r3680/hwloc/include/hwloc/helper.h:660: Warning: member hwloc_distributev: ignoring the detailed description found here, since another one was found at line 630 of file /home/mpiteam/hwloc/nightly-tarball-build-root/trunk/create-r3680/hwloc/include/hwloc/helper.h!
/home/mpiteam/hwloc/nightly-tarball-build-root/trunk/create-r3680/hwloc/include/hwloc/helper.h:660: Warning: member hwloc_distributev: ignoring the brief description found here, since another one was found at line 630 of file /home/mpiteam/hwloc/nightly-tarball-build-root/trunk/create-r3680/hwloc/include/hwloc/helper.h!
/home/mpiteam/hwloc/nightly-tarball-build-root/trunk/create-r3680/hwloc/doc/hwloc.doxy:267: Warning: Illegal command textwidth as part of a \image
/home/mpiteam/hwloc/nightly-tarball-build-root/trunk/create-r3680/hwloc/doc/hwloc.doxy:425: Warning: unable to resolve reference to `termsanddefs' for \ref command
/home/mpiteam/hwloc/nightly-tarball-build-root/trunk/create-r3680/hwloc/doc/hwloc.doxy:435: Warning: unable to resolve reference to `interoperability' for \ref command
/home/mpiteam/hwloc/nightly-tarball-build-root/trunk/create-r3680/hwloc/doc/hwloc.doxy:624: Warning: unable to resolve reference to `termsanddefs' for \ref command
/home/mpiteam/hwloc/nightly-tarball-build-root/trunk/create-r3680/hwloc/doc/hwloc.doxy:625: Warning: unable to resolve reference to `tools' for \ref command
/home/mpiteam/hwloc/nightly-tarball-build-root/trunk/create-r3680/hwloc/doc/hwloc.doxy:626: Warning: unable to resolve reference to `envvar' for \ref command
/home/mpiteam/hwloc/nightly-tarball-build-root/trunk/create-r3680/hwloc/doc/hwloc.doxy:627: Warning: unable to resolve reference to `cpu_mem_bind' for \ref command
/home/mpiteam/hwloc/nightly-tarball-build-root/trunk/create-r3680/hwloc/doc/hwloc.doxy:628: Warning: unable to resolve reference to `iodevices' for \ref command
/home/mpiteam/hwloc/nightly-tarball-build-root/trunk/create-r3680/hwloc/doc/hwloc.doxy:629: Warning: unable to resolve reference to `interoperability' for \ref command
/home/mpiteam/hwloc/nightly-tarball-build-root/trunk/create-r3680/hwloc/doc/hwloc.doxy:630: Warning: unable to resolve reference to `threadsafety' for \ref command
/home/mpiteam/hwloc/nightly-tarball-build-root/trunk/create-r3680/hwloc/doc/hwloc.doxy:631: Warning: unable to resolve reference to `embed' for \ref command
/home/mpiteam/hwloc/nightly-tarball-build-root/trunk/create-r3680/hwloc/doc/hwloc.doxy:632: Warning: unable to resolve reference to `faq' for \ref command
/home/mpiteam/hwloc/nightly-tarball-build-root/trunk/create-r3680/hwloc/doc/hwloc.doxy:643: Warning: Found unknown command `\page'
/home/mpiteam/hwloc/nightly-tarball-build-root/trunk/create-r3680/hwloc/doc/hwloc.doxy:754: Warning: Illegal command textwidth as part of a \image
/home/mpiteam/hwloc/nightly-tarball-build-root/trunk/create-r3680/hwloc/doc/hwloc.doxy:762: Warning: Found unknown command `\page'
/home/mpiteam/hwloc/nightly-tarball-build-root/trunk/create-r3680/hwloc/doc/hwloc.doxy:835: Warning: Found unknown command `\page'
/home/mpiteam/hwloc/nightly-tarball-build-root/trunk/create-r3680/hwloc/doc/hwloc.doxy:954: Warning: Found unknown command `\page'
/home/mpiteam/hwloc/nightly-tarball-build-root/trunk/create-r3680/hwloc/doc/hwloc.doxy:1012: Warning: Found unknown command `\page'
/home/mpiteam/hwloc/nightly-tarball-build-root/trunk/create-r3680/hwloc/doc/hwloc.doxy:1081: Warning: unable to resolve reference to `interoperability' for \ref command
/home/mpiteam/hwloc/nightly-tarball-build-root/trunk/create-r3680/hwloc/doc/hwloc.doxy:1175: Warning: Found unknown command `\page'
/home/mpiteam/hwloc/nightly-tarball-build-root/trunk/create-r3680/hwloc/doc/hwloc.doxy:1256: Warning: Found unknown command `\page'
/home/mpiteam/hwloc/nightly-tarball-build-root/trunk/create-r3680/hwloc/doc/hwloc.doxy:1319: Warning: Found unknown command `\page'
/home/mpiteam/hwloc/nightly-tarball-build-root/trunk/create-r3680/hwloc/doc/hwloc.doxy:1487: Warning: Found unknown command `\page'
/home/mpiteam/hwloc/nightly-tarball-build-root/trunk/create-r3680/hwloc/doc/hwloc.doxy:267: Warning: Illegal command textwidth as part of a \image
/home/mpiteam/hwloc/nightly-tarball-build-root/trunk/create-r3680/hwloc/doc/hwloc.doxy:425: Warning: unable to resolve reference to `termsanddefs' for \ref command
/home/mpiteam/hwloc/nightly-tarball-build-root/trunk/create-r3680/hwloc/doc/hwloc.doxy:435: Warning: unable to resolve reference to `interoperability' for \ref command
/home/mpiteam/hwloc/nightly-tarball-build-root/trunk/create-r3680/hwloc/doc/hwloc.doxy:624: Warning: unable to resolve reference to `termsanddefs' for \ref command
/home/mpiteam/hwloc/nightly-tarball-build-root/trunk/create-r3680/hwloc/doc/hwloc.doxy:625: Warning: unable to resolve reference to `tools' for \ref command
/home/mpiteam/hwloc/nightly-tarball-build-root/trunk/create-r3680/hwloc/doc/hwloc.doxy:626: Warning: unable to resolve reference to `envvar' for \ref command
/home/mpiteam/hwloc/nightly-tarball-build-root/trunk/create-r3680/hwloc/doc/hwloc.doxy:627: Warning: unable to resolve reference to `cpu_mem_bind' for \ref command
/home/mpiteam/hwloc/nightly-tarball-build-root/trunk/create-r3680/hwloc/doc/hwloc.doxy:628: Warning: unable to resolve reference to `iodevices' for \ref command
/home/mpiteam/hwloc/nightly-tarball-build-root/trunk/create-r3680/hwloc/doc/hwloc.doxy:629: Warning: unable to resolve reference to `interoperability' for \ref command
/home/mpiteam/hwloc/nightly-tarball-build-root/trunk/create-r3680/hwloc/doc/hwloc.doxy:630: Warning: unable to resolve reference to `threadsafety' for \ref command
/home/mpiteam/hwloc/nightly-tarball-build-root/trunk/create-r3680/hwloc/doc/hwloc.doxy:631: Warning: unable to resolve reference to `embed' for \ref command
/home/mpiteam/hwloc/nightly-tarball-build-root/trunk/create-r3680/hwloc/doc/hwloc.doxy:632: Warning: unable to resolve reference to `faq' for \ref command
/home/mpiteam/hwloc/nightly-tarball-build-root/trunk/create-r3680/hwloc/doc/hwloc.doxy:643: Warning: Found unknown command `\page'
/home/mpiteam/hwloc/nightly-tarball-build-root/trunk/create-r3680/hwloc/doc/hwloc.doxy:754: Warning: Illegal command textwidth as part of a \image
/home/mpiteam/hwloc/nightly-tarball-build-root/trunk/create-r3680/hwloc/doc/hwloc.doxy:762: Warning: Found unknown command `\page'
/home/mpiteam/hwloc/nightly-tarball-build-root/trunk/create-r3680/hwloc/doc/hwloc.doxy:835: Warning: Found unknown command `\page'
/home/mpiteam/hwloc/nightly-tarball-build-root/trunk/create-r3680/hwloc/doc/hwloc.doxy:954: Warning: Found unknown command `\page'
/home/mpiteam/hwloc/nightly-tarball-build-root/trunk/create-r3680/hwloc/doc/hwloc.doxy:1012: Warning: Found unknown command `\page'
/home/mpiteam/hwloc/nightly-tarball-build-root/trunk/create-r3680/hwloc/doc/hwloc.doxy:1081: Warning: unable to resolve reference to `interoperability' for \ref command
/home/mpiteam/hwloc/nightly-tarball-build-root/trunk/create-r3680/hwloc/doc/hwloc.doxy:1175: Warning: Found unknown command `\page'
/home/mpiteam/hwloc/nightly-tarball-build-root/trunk/create-r3680/hwloc/doc/hwloc.doxy:1256: Warning: Found unknown command `\page'
/home/mpiteam/hwloc/nightly-tarball-build-root/trunk/create-r3680/hwloc/doc/hwloc.doxy:1319: Warning: Found unknown command `\page'
/home/mpiteam/hwloc/nightly-tarball-build-root/trunk/create-r3680/hwloc/doc/hwloc.doxy:1487: Warning: Found unknown command `\page'
Searching for include files...
Searching for example files...
Searching for images...
Searching for dot files...
Searching for files to exclude
Reading input files...
Reading and parsing tag files
Preprocessing /home/mpiteam/hwloc/nightly-tarball-build-root/trunk/create-r3680/hwloc/doc/hwloc.doxy...
Preprocessing /home/mpiteam/hwloc/nightly-tarball-build-root/trunk/create-r3680/hwloc/include/hwloc.h...
Preprocessing /home/mpiteam/hwloc/nightly-tarball-build-root/trunk/create-r3680/hwloc/include/hwloc/helper.h...
Preprocessing /home/mpiteam/hwloc/nightly-tarball-build-root/trunk/create-r3680/hwloc/include/hwloc/bitmap.h...
Preprocessing /home/mpiteam/hwloc/nightly-tarball-build-root/trunk/create-r3680/hwloc/include/hwloc/glibc-sched.h...
Preprocessing /home/mpiteam/hwloc/nightly-tarball-build-root/trunk/create-r3680/hwloc/include/hwloc/linux.h...
Preprocessing /home/mpiteam/hwloc/nightly-tarball-build-root/trunk/create-r3680/hwloc/include/hwloc/linux-libnuma.h...
Preprocessing /home/mpiteam/hwloc/nightly-tarball-build-root/trunk/create-r3680/hwloc/include/hwloc/cuda.h...
Preprocessing /home/mpiteam/hwloc/nightly-tarball-build-root/trunk/create-r3680/hwloc/include/hwloc/cudart.h...
Preprocessing /home/mpiteam/hwloc/nightly-tarball-build-root/trunk/create-r3680/hwloc/include/hwloc/openfabrics-verbs.h...
Preprocessing /home/mpiteam/hwloc/nightly-tarball-build-root/trunk/create-r3680/hwloc/include/hwloc/myriexpress.h...
Read 235224 bytes
Parsing input...
Parsing file /home/mpiteam/hwloc/nightly-tarball-build-root/trunk/create-r3680/hwloc/doc/hwloc.doxy...
Parsing file /home/mpiteam/hwloc/nightly-tarball-build-root/trunk/create-r3680/hwloc/include/hwloc.h...
Parsing file /home/mpiteam/hwloc/nightly-tarball-build-root/trunk/create-r3680/hwloc/include/hwloc/helper.h...
Parsing file /home/mpiteam/hwloc/nightly-tarball-build-root/trunk/create-r3680/hwloc/include/hwloc/bitmap.h...
Parsing file /home/mpiteam/hwloc/nightly-tarball-build-root/trunk/create-r3680/hwloc/include/hwloc/glibc-sched.h...
Parsing file /home/mpiteam/hwloc/nightly-tarball-build-root/trunk/create-r3680/hwloc/include/hwloc/linux.h...
Parsing file /home/mpiteam/hwloc/nightly-tarball-build-root/trunk/create-r3680/hwloc/include/hwloc/linux-libnuma.h...
Parsing file /home/mpiteam/hwloc/nightly-tarball-build-root/trunk/create-r3680/hwloc/include/hwloc/cuda.h...
Parsing file /home/mpiteam/hwloc/nightly-tarball-build-root/trunk/create-r3680/hwloc/include/hwloc/cudart.h...
Parsing file /home/mpiteam/hwloc/nightly-tarball-build-root/trunk/create-r3680/hwloc/include/hwloc/openfabrics-verbs.h...
Parsing file /home/mpiteam/hwloc/nightly-tarball-build-root/trunk/create-r3680/hwloc/include/hwloc/myriexpress.h...
Freeing input...
Building group list...
Building directory list...
Building namespace list...
Building file list...
Searching for included using directives...
Building class list...
Building example list...
Searching for documented variables...
Building member list...
Searching for friends...
Searching for documented defines...
Computing template instances...
Flushing cached template relations that have become invalid...
Creating members for template instances...
Computing class relations...
Searching for enumerations...
Searching for members imported via using declarations...
Searching for member function documentation...
Building page list...
Search for main page...
Sorting lists...
Freeing entry tree
Determining which enums are documented
Computing member relations...
Building full member lists recursively...
Adding members to member groups.
Computing member references...
Inheriting documentation...
Generating disk names...
Adding source references...
Adding todo/test/bug list items...
Generating style sheet...
Counting data structures...
Resolving user defined references...
Combining using relations...
Finding anchors and sections in the documentation...
Generating index page...
Generating file index...
Generating example documentation...
Generating file sources...
Generating code for file bitmap.h...
Generating code for file cuda.h...
Generating code for file cuda/home/mpiteam/hwloc/nightly-tarball-build-root/trunk/create-r3680/hwloc/include/hwloc.h:213: Warning: Found unknown command `\private'
rt.h...
Generating code for file glibc-sched.h...
Generating code for file helper.h...
Generating code for file hwloc.h...
Generating code for file linux-libnuma.h...
Generating code for file linux.h...
Generating code for file myriexpress.h...
Generating code for file openfabrics-verbs.h...
Generating file documentation...
Generating docs for file bitmap.h...
Generating docs for file cuda.h...
Generating docs for file cudart.h...
Generating docs for file glibc-sched.h...
Generating docs for file helper.h...
Generating docs for file hwloc.doxy...
Generating docs for file hwloc.h...
Generating docs for file linux-libnuma.h...
Generating docs for file linux.h...
Generating docs for file myriexpress.h...
Generating docs for file openfabrics-verbs.h...
Generating class documentation...
Generating annotated compound index...
Generating hierarchical class index...
Generating member index...
Generating docs for compound hwloc_distances_s...
Generating docs for compound hwloc_obj...
Generating docs for compound hwloc_obj_attr_u...
Generating docs for nested compound hwloc_obj_attr_u::hwloc_bridge_attr_s...
Generating docs for nested compound hwloc_obj_attr_u::hwloc_cache_attr_s...
Generating docs for nested compound hwloc_obj_attr_u::hwloc_group_attr_s...
Generating docs for nested compound hwloc_obj_attr_u::hwloc_osdev_attr_s...
Generating docs for nested compound hwloc_obj_attr_u::hwloc_pcidev_attr_s...
Generating docs for compound hwloc_obj_info_s...
Generating docs for compound hwloc_obj_memory_s...
Generating docs for nested compound hwloc_obj_memory_s::hwloc_obj_memory_page_type_s...
Generating docs for compound hwloc_topology_cpubind_support...
Generating docs for compound hwloc_topology_discovery_support...
Generating docs for compound hwloc_topology_membind_support...
Generating docs for compound hwloc_topology_support...
Generating page documentation...
Generating group documentation...
Generating namespace index...
Generating group index...
Generating example index...
Generating file member index...
Generating namespace member index...
Generating page index...
Generating graph info page...
/bin/sed -i -e 's/__hwloc_restrict/restrict/g' \
          -e 's/\\_\\-\\_\\-hwloc\\_\\-restrict/restrict/g' \
          -e 's/__hwloc_attribute_unused//g' \
          -e 's/\\_\\-\\_\\-hwloc\\_\\-attribute\\_\\-unused//g' \
          -e 's/__hwloc_attribute_malloc//g' \
          -e 's/\\_\\-\\_\\-hwloc\\_\\-attribute\\_\\-malloc//g' \
          -e 's/__hwloc_attribute_const//g' \
          -e 's/\\_\\-\\_\\-hwloc\\_\\-attribute\\_\\-const//g' \
          -e 's/__hwloc_attribute_pure//g' \
          -e 's/\\_\\-\\_\\-hwloc\\_\\-attribute\\_\\-pure//g' \
          -e 's/__hwloc_attribute_deprecated//g' \
          -e 's/\\_\\-\\_\\-hwloc\\_\\-attribute\\_\\-deprecated//g' \
          -e 's/HWLOC_DECLSPEC//g' \
          -e 's/HWLOC\\_\\-DECLSPEC//g' \
          -e 's/__hwloc_inline/inline/g' \
          -e 's/\\_\\-\\_\\-hwloc\\_\\-inline/inline/g' \
doxygen-doc/html/*.html doxygen-doc/latex/*.tex doxygen-doc/man/man3/*.3
Work-around spurious leading _ in doxygen filenames...
(cd doxygen-doc/man/man3 ; \
for i in _hwloc* ; do \
        [ ! -f $i ] || mv $i ${i#_} ; \
done)
Removing useless manpages...
cd doxygen-doc/latex; \
rm -f *.aux *.toc *.idx *.ind *.ilg *.log *.out; \
/bin/sed -e 's/a4paper/letterpaper/g' -e 's/\\usepackage{a4wide}//' refman.tex > letter-refman.tex; \
/usr/bin/pdflatex letter-refman.tex; \
/usr/bin/makeindex letter-refman.idx; \
/usr/bin/pdflatex letter-refman.tex; \
done=0; repeat=5; \
while test $done = 0 -a $repeat -gt 0; do \
           if /bin/grep -E 'Rerun (LaTeX|to get cross-references right)' letter-refman.log > /dev/null 2>&1; then \
       /usr/bin/pdflatex letter-refman.tex; \
       repeat=`expr $repeat - 1`; \
   else \
       done=1; \
   fi; \
done; \
mv letter-refman.pdf /home/mpiteam/hwloc/nightly-tarball-build-root/trunk/create-r3680/hwloc/doc/doxygen-doc/hwloc-letter.pdf
This is pdfTeX, Version 3.14159-1.10b (Web2C 7.4.5)
(./letter-refman.tex{/usr/share/texmf/pdftex/config/pdftex.cfg}
LaTeX2e <2001/06/01>
Babel <v3.7h> and hyphenation patterns for american, french, german, ngerman, n
ohyphenation, loaded.
(/usr/share/texmf/tex/latex/base/book.cls
Document Class: book 2001/04/21 v1.4e Standard LaTeX document class
(/usr/share/texmf/tex/latex/base/bk10.clo))
(/usr/share/texmf/tex/latex/base/makeidx.sty)
(/usr/share/texmf/tex/latex/fancyhdr/fancyhdr.sty)
(/usr/share/texmf/tex/latex/graphics/graphicx.sty
(/usr/share/texmf/tex/latex/graphics/keyval.sty)
(/usr/share/texmf/tex/latex/graphics/graphics.sty
(/usr/share/texmf/tex/latex/graphics/trig.sty)
(/usr/share/texmf/tex/latex/config/graphics.cfg)
(/usr/share/texmf/tex/latex/graphics/pdftex.def)))
(/usr/share/texmf/tex/latex/tools/multicol.sty)
(/usr/share/texmf/tex/latex/misc/float.sty)
(/usr/share/texmf/tex/latex/base/textcomp.sty
(/usr/share/texmf/tex/latex/base/ts1enc.def))
(/usr/share/texmf/tex/latex/base/alltt.sty)
(/usr/share/texmf/tex/latex/psnfss/times.sty)
(/usr/share/texmf/tex/latex/hyperref/hyperref.sty
(/usr/share/texmf/tex/latex/hyperref/pd1enc.def)
(/usr/share/texmf/tex/latex/config/hyperref.cfg)
Implicit mode ON; LaTeX internals redefined
(/usr/share/texmf/tex/latex/hyperref/backref.sty)
(/usr/share/texmf/tex/latex/html/url.sty))
*hyperref using driver hpdftex*
(/usr/share/texmf/tex/latex/hyperref/hpdftex.def
(/usr/share/texmf/tex/latex/psnfss/pifont.sty
(/usr/share/texmf/tex/latex/psnfss/upzd.fd)
(/usr/share/texmf/tex/latex/psnfss/upsy.fd))) (./doxygen.sty
(/usr/share/texmf/tex/latex/tools/calc.sty)
(/usr/share/texmf/tex/latex/tools/array.sty))
(/usr/share/texmf/tex/latex/base/fontenc.sty
(/usr/share/texmf/tex/latex/base/t1enc.def))
Writing index file letter-refman.idx
No file letter-refman.aux.
(/usr/share/texmf/tex/latex/base/ts1cmr.fd)
(/usr/share/texmf/tex/latex/psnfss/t1ptm.fd)
(/usr/share/texmf/tex/context/base/supp-pdf.tex
(/usr/share/texmf/tex/context/base/supp-mis.tex
loading : Context Support Macros / Missing
)
loading : Context Support Macros / PDF
) (/usr/share/texmf/tex/latex/graphics/color.sty
(/usr/share/texmf/tex/latex/config/color.cfg))
(/usr/share/texmf/tex/latex/hyperref/nameref.sty) [1{/usr/share/texmf/dvips/con
fig/pdftex.map}] [2]
! pdfTeX warning (ext4): destination with the same identifier (name{page.1}) ha
s been already used, duplicate ignored
<to be read again>
                   \penalty
l.44 \clearemptydoublepage
                           [1]
! pdfTeX warning (ext4): destination with the same identifier (name{page.2}) ha
s been already used, duplicate ignored
<to be read again>
                   \penalty
l.44 \clearemptydoublepage
                           [2]
Chapter 1.
(./index.tex (/usr/share/texmf/tex/latex/psnfss/ts1ptm.fd)
! pdfTeX warning (ext4): destination with the same identifier (name{page.1}) ha
s been already used, duplicate ignored
<to be read again>
                   \penalty
l.17 ...d support) \item Solaris \item AIX \item D
                                                  arwin / OS X \item Free\-B...
[1] (/usr/share/texmf/tex/latex/psnfss/t1pcr.fd)
! pdfTeX warning (ext4): destination with the same identifier (name{page.2}) ha
s been already used, duplicate ignored
<to be read again>
                   \penalty
l.44
      [2] <dudley.png, id=53, 451.6875pt x 572.1375pt> <use dudley.png>
Underfull \vbox (badness 1048) has occurred while \output is active [3]
[4 <./dudley.png>]
Overfull \hbox (10.20023pt too wide) in paragraph at lines 186--186
[] /pcrr8t_at_8.0pt/dmi_board_vendor="Dell Computer Corporation" dmi_board_na
me="0RD318"[]

Overfull \hbox (0.60022pt too wide) in paragraph at lines 186--186
[] /pcrr8t_at_8.0pt/<object type="Socket" os_level="-1" os_index="0" cpuset="0x
00001111"[]

Overfull \hbox (29.40024pt too wide) in paragraph at lines 186--186
[] /pcrr8t_at_8.0pt/<object type="Core" os_level="-1" os_index="0" cpus
et="0x00000101"[]

Overfull \hbox (29.40024pt too wide) in paragraph at lines 186--186
[] /pcrr8t_at_8.0pt/<object type="PU" os_level="-1" os_index="0" cpus
et="0x00000001"[]

Overfull \hbox (5.40022pt too wide) in paragraph at lines 186--186
[] /pcrr8t_at_8.0pt/complete_cpuset="0x00000001" online_cpuset="0
x00000001"[]

Overfull \hbox (29.40024pt too wide) in paragraph at lines 186--186
[] /pcrr8t_at_8.0pt/<object type="PU" os_level="-1" os_index="8" cpus
et="0x00000100"[]

Overfull \hbox (5.40022pt too wide) in paragraph at lines 186--186
[] /pcrr8t_at_8.0pt/complete_cpuset="0x00000100" online_cpuset="0
x00000100"[]
[5]
Overfull \hbox (29.40024pt too wide) in paragraph at lines 186--186
[] /pcrr8t_at_8.0pt/<object type="Core" os_level="-1" os_index="1" cpus
et="0x00001010"[]

Overfull \hbox (29.40024pt too wide) in paragraph at lines 186--186
[] /pcrr8t_at_8.0pt/<object type="PU" os_level="-1" os_index="4" cpus
et="0x00000010"[]

Overfull \hbox (5.40022pt too wide) in paragraph at lines 186--186
[] /pcrr8t_at_8.0pt/complete_cpuset="0x00000010" online_cpuset="0
x00000010"[]

Overfull \hbox (34.20024pt too wide) in paragraph at lines 186--186
[] /pcrr8t_at_8.0pt/<object type="PU" os_level="-1" os_index="12" cpu
set="0x00001000"[]

Overfull \hbox (5.40022pt too wide) in paragraph at lines 186--186
[] /pcrr8t_at_8.0pt/complete_cpuset="0x00001000" online_cpuset="0
x00001000"[]
<hagrid.png, id=74, 973.6375pt x 291.0875pt> <use hagrid.png>
Overfull \hbox (628.63512pt too wide) in paragraph at lines 194--194
 []

Underfull \vbox (badness 10000) has occurred while \output is active [6]
[7 <./hagrid.png>]
Overfull \hbox (10.20023pt too wide) in paragraph at lines 271--271
[] /pcrr8t_at_8.0pt/<object type="NUMANode" os_level="-1" os_index="0" cpuset="
0x00000003"[]

Overfull \hbox (10.20023pt too wide) in paragraph at lines 271--271
[] /pcrr8t_at_8.0pt/<object type="Socket" os_level="-1" os_index="0" cpuset="
0x00000003"[]

Overfull \hbox (0.60022pt too wide) in paragraph at lines 271--271
[] /pcrr8t_at_8.0pt/complete_nodeset="0x00000001" allowed_nodeset="0x
00000001"[]

Overfull \hbox (29.40024pt too wide) in paragraph at lines 271--271
[] /pcrr8t_at_8.0pt/<object type="PU" os_level="-1" os_index="0" cpus
et="0x00000001"[]

Overfull \hbox (5.40022pt too wide) in paragraph at lines 271--271
[] /pcrr8t_at_8.0pt/complete_cpuset="0x00000001" online_cpuset="0
x00000001"[]

Overfull \hbox (29.40024pt too wide) in paragraph at lines 271--271
[] /pcrr8t_at_8.0pt/complete_nodeset="0x00000001" allowed_nodeset
="0x00000001"/>[]
<emmett.png, id=84, 431.6125pt x 431.6125pt> <use emmett.png>
Underfull \vbox (badness 10000) has occurred while \output is active [8]
Overfull \hbox (0.60022pt too wide) in paragraph at lines 352--352
[] /pcrr8t_at_8.0pt/<object type="Socket" os_level="-1" os_index="0" cpuset="0x
00000055"[]
[9 <./emmett.png>]
Overfull \hbox (19.80023pt too wide) in paragraph at lines 352--352
[] /pcrr8t_at_8.0pt/<object type="Core" os_level="-1" os_index="0" cpuset
="0x00000001"[]

Overfull \hbox (19.80023pt too wide) in paragraph at lines 352--352
[] /pcrr8t_at_8.0pt/<object type="PU" os_level="-1" os_index="0" cpuset
="0x00000001"[]

Overfull \hbox (19.80023pt too wide) in paragraph at lines 352--352
[] /pcrr8t_at_8.0pt/<object type="Core" os_level="-1" os_index="1" cpuset
="0x00000010"[]

Overfull \hbox (19.80023pt too wide) in paragraph at lines 352--352
[] /pcrr8t_at_8.0pt/<object type="PU" os_level="-1" os_index="4" cpuset
="0x00000010"[]

Underfull \vbox (badness 2478) has occurred while \output is active [10]
<ppc64-with-smt.pdf, id=106, 1154.3125pt x 431.6125pt>
<use ppc64-with-smt.pdf>
<ppc64-without-smt.pdf, id=107, 592.2125pt x 431.6125pt>
<use ppc64-without-smt.pdf>
Underfull \vbox (badness 10000) has occurred while \output is active [11 <./ppc
64-with-smt.pdf
Warning: /usr/bin/pdflatex (file ./ppc64-with-smt.pdf): pdf inclusion: Page Gro
up detected which pdfTeX can't handle. Ignoring it.
>] <ppc64-full-with-smt.pdf, id=126, 913.4125pt x 1355.0625pt>
<use ppc64-full-with-smt.pdf>
Underfull \vbox (badness 10000) has occurred while \output is active [12 <./ppc
64-without-smt.pdf
Warning: /usr/bin/pdflatex (file ./ppc64-without-smt.pdf): pdf inclusion: Page
Group detected which pdfTeX can't handle. Ignoring it.
>]
Underfull \vbox (badness 10000) has occurred while \output is active [13 <./ppc
64-full-with-smt.pdf
Warning: /usr/bin/pdflatex (file ./ppc64-full-with-smt.pdf): pdf inclusion: Pag
e Group detected which pdfTeX can't handle. Ignoring it.
>] [14]
Underfull \vbox (badness 10000) has occurred while \output is active [15]
Overfull \hbox (24.60023pt too wide) in paragraph at lines 567--567
[] /pcrr8t_at_8.0pt/printf("Couldn't bind to cpuset %s: %s\n", str, str
error(error));[]

Underfull \vbox (badness 10000) has occurred while \output is active [16]
[17]
Underfull \hbox (badness 10000) in paragraph at lines 623--624
/ptmr8t/Questions should be sent to the de-vel mail-ing list

Underfull \hbox (badness 10000) in paragraph at lines 623--624
/ptmr8t/([][]/pcrr8t/http://www.open-mpi.org/community/lists/hwloc.php[][]/ptmr
8t/).

Underfull \hbox (badness 10000) in paragraph at lines 623--624
/ptmr8t/Bug re-ports should be re-ported in the tracker

Underfull \hbox (badness 10000) in paragraph at lines 630--631
/ptmr8t/hwloc is the evo-lu-tion and merger of the libtopol-ogy

Underfull \hbox (badness 10000) in paragraph at lines 630--631
/ptmr8t/([][]/pcrr8t/http://runtime.bordeaux.inria.fr/libtopology/[][]/ptmr8t/)

Underfull \hbox (badness 10000) in paragraph at lines 630--631
/ptmr8t/project and the Portable Linux Pro-ces-sor Affin-ity (PLPA)

Underfull \hbox (badness 6592) in paragraph at lines 630--631
/ptmr8t/([][]/pcrr8t/http://www.open-mpi.org/projects/plpa/[][]/ptmr8t/) projec
t. Be-cause of

Underfull \hbox (badness 10000) in paragraph at lines 632--633
[]/ptmr8t/libtopology was ini-tially de-vel-oped by the IN-RIA Run-time Team-Pr
oject

Underfull \hbox (badness 3019) in paragraph at lines 632--633
/ptmr8t/([][]/pcrr8t/http://runtime.bordeaux.inria.fr/[][]/ptmr8t/) (headed by
Ray-mond Namyst

Underfull \vbox (badness 1824) has occurred while \output is active [18]
[19] [20] <diagram.pdf, id=206, 672.5125pt x 690.58pt> <use diagram.pdf>
Overfull \hbox (327.51085pt too wide) in paragraph at lines 689--689
 []

Underfull \vbox (badness 10000) has occurred while \output is active [21]
Overfull \vbox (175.74323pt too high) has occurred while \output is active
[22 <./diagram.pdf>] [23]
Underfull \hbox (badness 1924) in paragraph at lines 727--728
[]/ptmr8t/enforces the re-turn value of [][]hwloc_-topology_-is_-
[24]
Underfull \hbox (badness 2027) in paragraph at lines 733--734
[]/ptmr8t/relaxes dis-tance com-par-i-son dur-ing
[25] [26]
Underfull \hbox (badness 1303) in paragraph at lines 772--773
/ptmr8t/When I/O dis-cov-ery is en-abled and sup-ported, some ad-di-tional ob-j
ects (types

Underfull \hbox (badness 10000) in paragraph at lines 772--773
[][]/pcrr8t/HWLOC_-OBJ_-BRIDGE[][]/ptmr8t/, [][]/pcrr8t/HWLOC_-OBJ_-PCI_-DEVICE
[][] /ptmr8t/and [][]/pcrr8t/HWLOC_-OBJ_-OS_-
[27] [28]Error: PDF version 1.5 -- xpdf supports version 1.4 (continuing anyway)

Error: /usr/bin/pdflatex (file devel09-pci.pdf): pdf inclusion: found pdf versi
on <1.5>, but at most version <1.4> allowed
 ==> Fatal error occurred, the output PDF file is not finished!
This is makeindex, version 2.14 [02-Oct-2002] (kpathsea + Thai support).
Scanning input file letter-refman.idx...done (0 entries accepted, 0 rejected).
Nothing written in letter-refman.ind.
Transcript written in letter-refman.ilg.
This is pdfTeX, Version 3.14159-1.10b (Web2C 7.4.5)
(./letter-refman.tex{/usr/share/texmf/pdftex/config/pdftex.cfg}
LaTeX2e <2001/06/01>
Babel <v3.7h> and hyphenation patterns for american, french, german, ngerman, n
ohyphenation, loaded.
(/usr/share/texmf/tex/latex/base/book.cls
Document Class: book 2001/04/21 v1.4e Standard LaTeX document class
(/usr/share/texmf/tex/latex/base/bk10.clo))
(/usr/share/texmf/tex/latex/base/makeidx.sty)
(/usr/share/texmf/tex/latex/fancyhdr/fancyhdr.sty)
(/usr/share/texmf/tex/latex/graphics/graphicx.sty
(/usr/share/texmf/tex/latex/graphics/keyval.sty)
(/usr/share/texmf/tex/latex/graphics/graphics.sty
(/usr/share/texmf/tex/latex/graphics/trig.sty)
(/usr/share/texmf/tex/latex/config/graphics.cfg)
(/usr/share/texmf/tex/latex/graphics/pdftex.def)))
(/usr/share/texmf/tex/latex/tools/multicol.sty)
(/usr/share/texmf/tex/latex/misc/float.sty)
(/usr/share/texmf/tex/latex/base/textcomp.sty
(/usr/share/texmf/tex/latex/base/ts1enc.def))
(/usr/share/texmf/tex/latex/base/alltt.sty)
(/usr/share/texmf/tex/latex/psnfss/times.sty)
(/usr/share/texmf/tex/latex/hyperref/hyperref.sty
(/usr/share/texmf/tex/latex/hyperref/pd1enc.def)
(/usr/share/texmf/tex/latex/config/hyperref.cfg)
Implicit mode ON; LaTeX internals redefined
(/usr/share/texmf/tex/latex/hyperref/backref.sty)
(/usr/share/texmf/tex/latex/html/url.sty))
*hyperref using driver hpdftex*
(/usr/share/texmf/tex/latex/hyperref/hpdftex.def
(/usr/share/texmf/tex/latex/psnfss/pifont.sty
(/usr/share/texmf/tex/latex/psnfss/upzd.fd)
(/usr/share/texmf/tex/latex/psnfss/upsy.fd))) (./doxygen.sty
(/usr/share/texmf/tex/latex/tools/calc.sty)
(/usr/share/texmf/tex/latex/tools/array.sty))
(/usr/share/texmf/tex/latex/base/fontenc.sty
(/usr/share/texmf/tex/latex/base/t1enc.def))
Writing index file letter-refman.idx
(./letter-refman.aux) (/usr/share/texmf/tex/latex/base/ts1cmr.fd)
(/usr/share/texmf/tex/latex/psnfss/t1ptm.fd)
(/usr/share/texmf/tex/context/base/supp-pdf.tex
(/usr/share/texmf/tex/context/base/supp-mis.tex
loading : Context Support Macros / Missing
)
loading : Context Support Macros / PDF
) (/usr/share/texmf/tex/latex/graphics/color.sty
(/usr/share/texmf/tex/latex/config/color.cfg))
(/usr/share/texmf/tex/latex/hyperref/nameref.sty) (./letter-refman.out)
(./letter-refman.out) [1{/usr/share/texmf/dvips/config/pdftex.map}] [2]
(./letter-refman.toc)
! pdfTeX warning (ext4): destination with the same identifier (name{page.1}) ha
s been already used, duplicate ignored
<to be read again>
                   \penalty
l.44 \clearemptydoublepage
                           [1]
! pdfTeX warning (ext4): destination with the same identifier (name{page.2}) ha
s been already used, duplicate ignored
<to be read again>
                   \penalty
l.44 \clearemptydoublepage
                           [2]
Chapter 1.
(./index.tex (/usr/share/texmf/tex/latex/psnfss/ts1ptm.fd)
! pdfTeX warning (ext4): destination with the same identifier (name{page.1}) ha
s been already used, duplicate ignored
<to be read again>
                   \penalty
l.17 ...d support) \item Solaris \item AIX \item D
                                                  arwin / OS X \item Free\-B...
[1] (/usr/share/texmf/tex/latex/psnfss/t1pcr.fd)
! pdfTeX warning (ext4): destination with the same identifier (name{page.2}) ha
s been already used, duplicate ignored
<to be read again>
                   \penalty
l.44
      [2] <dudley.png, id=123, 451.6875pt x 572.1375pt> <use dudley.png>
Underfull \vbox (badness 1048) has occurred while \output is active [3]
[4 <./dudley.png>]
Overfull \hbox (10.20023pt too wide) in paragraph at lines 186--186
[] /pcrr8t_at_8.0pt/dmi_board_vendor="Dell Computer Corporation" dmi_board_na
me="0RD318"[]

Overfull \hbox (0.60022pt too wide) in paragraph at lines 186--186
[] /pcrr8t_at_8.0pt/<object type="Socket" os_level="-1" os_index="0" cpuset="0x
00001111"[]

Overfull \hbox (29.40024pt too wide) in paragraph at lines 186--186
[] /pcrr8t_at_8.0pt/<object type="Core" os_level="-1" os_index="0" cpus
et="0x00000101"[]

Overfull \hbox (29.40024pt too wide) in paragraph at lines 186--186
[] /pcrr8t_at_8.0pt/<object type="PU" os_level="-1" os_index="0" cpus
et="0x00000001"[]

Overfull \hbox (5.40022pt too wide) in paragraph at lines 186--186
[] /pcrr8t_at_8.0pt/complete_cpuset="0x00000001" online_cpuset="0
x00000001"[]

Overfull \hbox (29.40024pt too wide) in paragraph at lines 186--186
[] /pcrr8t_at_8.0pt/<object type="PU" os_level="-1" os_index="8" cpus
et="0x00000100"[]

Overfull \hbox (5.40022pt too wide) in paragraph at lines 186--186
[] /pcrr8t_at_8.0pt/complete_cpuset="0x00000100" online_cpuset="0
x00000100"[]
[5]
Overfull \hbox (29.40024pt too wide) in paragraph at lines 186--186
[] /pcrr8t_at_8.0pt/<object type="Core" os_level="-1" os_index="1" cpus
et="0x00001010"[]

Overfull \hbox (29.40024pt too wide) in paragraph at lines 186--186
[] /pcrr8t_at_8.0pt/<object type="PU" os_level="-1" os_index="4" cpus
et="0x00000010"[]

Overfull \hbox (5.40022pt too wide) in paragraph at lines 186--186
[] /pcrr8t_at_8.0pt/complete_cpuset="0x00000010" online_cpuset="0
x00000010"[]

Overfull \hbox (34.20024pt too wide) in paragraph at lines 186--186
[] /pcrr8t_at_8.0pt/<object type="PU" os_level="-1" os_index="12" cpu
set="0x00001000"[]

Overfull \hbox (5.40022pt too wide) in paragraph at lines 186--186
[] /pcrr8t_at_8.0pt/complete_cpuset="0x00001000" online_cpuset="0
x00001000"[]
<hagrid.png, id=142, 973.6375pt x 291.0875pt> <use hagrid.png>
Overfull \hbox (628.63512pt too wide) in paragraph at lines 194--194
 []

Underfull \vbox (badness 10000) has occurred while \output is active [6]
[7 <./hagrid.png>]
Overfull \hbox (10.20023pt too wide) in paragraph at lines 271--271
[] /pcrr8t_at_8.0pt/<object type="NUMANode" os_level="-1" os_index="0" cpuset="
0x00000003"[]

Overfull \hbox (10.20023pt too wide) in paragraph at lines 271--271
[] /pcrr8t_at_8.0pt/<object type="Socket" os_level="-1" os_index="0" cpuset="
0x00000003"[]

Overfull \hbox (0.60022pt too wide) in paragraph at lines 271--271
[] /pcrr8t_at_8.0pt/complete_nodeset="0x00000001" allowed_nodeset="0x
00000001"[]

Overfull \hbox (29.40024pt too wide) in paragraph at lines 271--271
[] /pcrr8t_at_8.0pt/<object type="PU" os_level="-1" os_index="0" cpus
et="0x00000001"[]

Overfull \hbox (5.40022pt too wide) in paragraph at lines 271--271
[] /pcrr8t_at_8.0pt/complete_cpuset="0x00000001" online_cpuset="0
x00000001"[]

Overfull \hbox (29.40024pt too wide) in paragraph at lines 271--271
[] /pcrr8t_at_8.0pt/complete_nodeset="0x00000001" allowed_nodeset
="0x00000001"/>[]
<emmett.png, id=152, 431.6125pt x 431.6125pt> <use emmett.png>
Underfull \vbox (badness 10000) has occurred while \output is active [8]
Overfull \hbox (0.60022pt too wide) in paragraph at lines 352--352
[] /pcrr8t_at_8.0pt/<object type="Socket" os_level="-1" os_index="0" cpuset="0x
00000055"[]
[9 <./emmett.png>]
Overfull \hbox (19.80023pt too wide) in paragraph at lines 352--352
[] /pcrr8t_at_8.0pt/<object type="Core" os_level="-1" os_index="0" cpuset
="0x00000001"[]

Overfull \hbox (19.80023pt too wide) in paragraph at lines 352--352
[] /pcrr8t_at_8.0pt/<object type="PU" os_level="-1" os_index="0" cpuset
="0x00000001"[]

Overfull \hbox (19.80023pt too wide) in paragraph at lines 352--352
[] /pcrr8t_at_8.0pt/<object type="Core" os_level="-1" os_index="1" cpuset
="0x00000010"[]

Overfull \hbox (19.80023pt too wide) in paragraph at lines 352--352
[] /pcrr8t_at_8.0pt/<object type="PU" os_level="-1" os_index="4" cpuset
="0x00000010"[]

Underfull \vbox (badness 2478) has occurred while \output is active [10]
<ppc64-with-smt.pdf, id=173, 1154.3125pt x 431.6125pt>
<use ppc64-with-smt.pdf>
<ppc64-without-smt.pdf, id=174, 592.2125pt x 431.6125pt>
<use ppc64-without-smt.pdf>
Underfull \vbox (badness 10000) has occurred while \output is active [11 <./ppc
64-with-smt.pdf
Warning: /usr/bin/pdflatex (file ./ppc64-with-smt.pdf): pdf inclusion: Page Gro
up detected which pdfTeX can't handle. Ignoring it.
>] <ppc64-full-with-smt.pdf, id=193, 913.4125pt x 1355.0625pt>
<use ppc64-full-with-smt.pdf>
Underfull \vbox (badness 10000) has occurred while \output is active [12 <./ppc
64-without-smt.pdf
Warning: /usr/bin/pdflatex (file ./ppc64-without-smt.pdf): pdf inclusion: Page
Group detected which pdfTeX can't handle. Ignoring it.
>]
Underfull \vbox (badness 10000) has occurred while \output is active [13 <./ppc
64-full-with-smt.pdf
Warning: /usr/bin/pdflatex (file ./ppc64-full-with-smt.pdf): pdf inclusion: Pag
e Group detected which pdfTeX can't handle. Ignoring it.
>] [14]
Underfull \vbox (badness 10000) has occurred while \output is active [15]
Overfull \hbox (24.60023pt too wide) in paragraph at lines 567--567
[] /pcrr8t_at_8.0pt/printf("Couldn't bind to cpuset %s: %s\n", str, str
error(error));[]

Underfull \vbox (badness 10000) has occurred while \output is active [16]
[17]
Underfull \hbox (badness 10000) in paragraph at lines 623--624
/ptmr8t/Questions should be sent to the de-vel mail-ing list

Underfull \hbox (badness 10000) in paragraph at lines 623--624
/ptmr8t/([][]/pcrr8t/http://www.open-mpi.org/community/lists/hwloc.php[][]/ptmr
8t/).

Underfull \hbox (badness 10000) in paragraph at lines 623--624
/ptmr8t/Bug re-ports should be re-ported in the tracker

Underfull \hbox (badness 10000) in paragraph at lines 630--631
/ptmr8t/hwloc is the evo-lu-tion and merger of the libtopol-ogy

Underfull \hbox (badness 10000) in paragraph at lines 630--631
/ptmr8t/([][]/pcrr8t/http://runtime.bordeaux.inria.fr/libtopology/[][]/ptmr8t/)

Underfull \hbox (badness 10000) in paragraph at lines 630--631
/ptmr8t/project and the Portable Linux Pro-ces-sor Affin-ity (PLPA)

Underfull \hbox (badness 6592) in paragraph at lines 630--631
/ptmr8t/([][]/pcrr8t/http://www.open-mpi.org/projects/plpa/[][]/ptmr8t/) projec
t. Be-cause of

Underfull \hbox (badness 10000) in paragraph at lines 632--633
[]/ptmr8t/libtopology was ini-tially de-vel-oped by the IN-RIA Run-time Team-Pr
oject

Underfull \hbox (badness 3019) in paragraph at lines 632--633
/ptmr8t/([][]/pcrr8t/http://runtime.bordeaux.inria.fr/[][]/ptmr8t/) (headed by
Ray-mond Namyst

Underfull \vbox (badness 1824) has occurred while \output is active [18]
[19] [20] <diagram.pdf, id=270, 672.5125pt x 690.58pt> <use diagram.pdf>
Overfull \hbox (327.51085pt too wide) in paragraph at lines 689--689
 []

Underfull \vbox (badness 10000) has occurred while \output is active [21]
Overfull \vbox (175.74323pt too high) has occurred while \output is active
[22 <./diagram.pdf>] [23]
Underfull \hbox (badness 1924) in paragraph at lines 727--728
[]/ptmr8t/enforces the re-turn value of [][]hwloc_-topology_-is_-
[24]
Underfull \hbox (badness 2027) in paragraph at lines 733--734
[]/ptmr8t/relaxes dis-tance com-par-i-son dur-ing
[25] [26]
Underfull \hbox (badness 1303) in paragraph at lines 772--773
/ptmr8t/When I/O dis-cov-ery is en-abled and sup-ported, some ad-di-tional ob-j
ects (types

Underfull \hbox (badness 10000) in paragraph at lines 772--773
[][]/pcrr8t/HWLOC_-OBJ_-BRIDGE[][]/ptmr8t/, [][]/pcrr8t/HWLOC_-OBJ_-PCI_-DEVICE
[][] /ptmr8t/and [][]/pcrr8t/HWLOC_-OBJ_-OS_-
[27] [28]Error: PDF version 1.5 -- xpdf supports version 1.4 (continuing anyway)

Error: /usr/bin/pdflatex (file devel09-pci.pdf): pdf inclusion: found pdf versi
on <1.5>, but at most version <1.4> allowed
 ==> Fatal error occurred, the output PDF file is not finished!
cd doxygen-doc/latex; \
rm -f *.aux *.toc *.idx *.ind *.ilg *.log *.out; \
cp refman.tex a4-refman.tex; \
/usr/bin/pdflatex a4-refman.tex; \
/usr/bin/makeindex a4-refman.idx; \
/usr/bin/pdflatex a4-refman.tex; \
done=0; repeat=5; \
while test $done = 0 -a $repeat -gt 0; do \
           if /bin/grep -E 'Rerun (LaTeX|to get cross-references right)' a4-refman.log > /dev/null 2>&1; then \
       /usr/bin/pdflatex a4-refman.tex; \
       repeat=`expr $repeat - 1`; \
   else \
       done=1; \
   fi; \
done; \
mv a4-refman.pdf /home/mpiteam/hwloc/nightly-tarball-build-root/trunk/create-r3680/hwloc/doc/doxygen-doc/hwloc-a4.pdf
This is pdfTeX, Version 3.14159-1.10b (Web2C 7.4.5)
(./a4-refman.tex{/usr/share/texmf/pdftex/config/pdftex.cfg}
LaTeX2e <2001/06/01>
Babel <v3.7h> and hyphenation patterns for american, french, german, ngerman, n
ohyphenation, loaded.
(/usr/share/texmf/tex/latex/base/book.cls
Document Class: book 2001/04/21 v1.4e Standard LaTeX document class
(/usr/share/texmf/tex/latex/base/bk10.clo))
(/usr/share/texmf/tex/latex/misc/a4wide.sty
(/usr/share/texmf/tex/latex/ntgclass/a4.sty))
(/usr/share/texmf/tex/latex/base/makeidx.sty)
(/usr/share/texmf/tex/latex/fancyhdr/fancyhdr.sty)
(/usr/share/texmf/tex/latex/graphics/graphicx.sty
(/usr/share/texmf/tex/latex/graphics/keyval.sty)
(/usr/share/texmf/tex/latex/graphics/graphics.sty
(/usr/share/texmf/tex/latex/graphics/trig.sty)
(/usr/share/texmf/tex/latex/config/graphics.cfg)
(/usr/share/texmf/tex/latex/graphics/pdftex.def)))
(/usr/share/texmf/tex/latex/tools/multicol.sty)
(/usr/share/texmf/tex/latex/misc/float.sty)
(/usr/share/texmf/tex/latex/base/textcomp.sty
(/usr/share/texmf/tex/latex/base/ts1enc.def))
(/usr/share/texmf/tex/latex/base/alltt.sty)
(/usr/share/texmf/tex/latex/psnfss/times.sty)
(/usr/share/texmf/tex/latex/hyperref/hyperref.sty
(/usr/share/texmf/tex/latex/hyperref/pd1enc.def)
(/usr/share/texmf/tex/latex/config/hyperref.cfg)
Implicit mode ON; LaTeX internals redefined
(/usr/share/texmf/tex/latex/hyperref/backref.sty)
(/usr/share/texmf/tex/latex/html/url.sty))
*hyperref using driver hpdftex*
(/usr/share/texmf/tex/latex/hyperref/hpdftex.def
(/usr/share/texmf/tex/latex/psnfss/pifont.sty
(/usr/share/texmf/tex/latex/psnfss/upzd.fd)
(/usr/share/texmf/tex/latex/psnfss/upsy.fd))) (./doxygen.sty
(/usr/share/texmf/tex/latex/tools/calc.sty)
(/usr/share/texmf/tex/latex/tools/array.sty))
(/usr/share/texmf/tex/latex/base/fontenc.sty
(/usr/share/texmf/tex/latex/base/t1enc.def))
Writing index file a4-refman.idx
No file a4-refman.aux.
(/usr/share/texmf/tex/latex/base/ts1cmr.fd)
(/usr/share/texmf/tex/latex/psnfss/t1ptm.fd)
(/usr/share/texmf/tex/context/base/supp-pdf.tex
(/usr/share/texmf/tex/context/base/supp-mis.tex
loading : Context Support Macros / Missing
)
loading : Context Support Macros / PDF
) (/usr/share/texmf/tex/latex/graphics/color.sty
(/usr/share/texmf/tex/latex/config/color.cfg))
(/usr/share/texmf/tex/latex/hyperref/nameref.sty) [1{/usr/share/texmf/dvips/con
fig/pdftex.map}] [2]
! pdfTeX warning (ext4): destination with the same identifier (name{page.1}) ha
s been already used, duplicate ignored
<to be read again>
                   \penalty
l.44 \clearemptydoublepage
                           [1]
! pdfTeX warning (ext4): destination with the same identifier (name{page.2}) ha
s been already used, duplicate ignored
<to be read again>
                   \penalty
l.44 \clearemptydoublepage
                           [2]
Chapter 1.
(./index.tex
Underfull \hbox (badness 10000) in paragraph at lines 1--1
[]/ptmb8t_at_14.4pt/Portable ab-strac-tion of hi-er-ar-chi-cal ar-chi-tec-tures fo
r high-
(/usr/share/texmf/tex/latex/psnfss/ts1ptm.fd)
! pdfTeX warning (ext4): destination with the same identifier (name{page.1}) ha
s been already used, duplicate ignored
<to be read again>
                   \penalty
l.21
      [1] (/usr/share/texmf/tex/latex/psnfss/t1pcr.fd)
! pdfTeX warning (ext4): destination with the same identifier (name{page.2}) ha
s been already used, duplicate ignored
<to be read again>
                   \penalty
l.70
      [2] <dudley.png, id=59, 451.6875pt x 572.1375pt> <use dudley.png>
[3 <./dudley.png>] [4] <hagrid.png, id=70, 973.6375pt x 291.0875pt>
<use hagrid.png>
Overfull \hbox (549.04887pt too wide) in paragraph at lines 194--194
 []
[5 <./hagrid.png>] <emmett.png, id=76, 431.6125pt x 431.6125pt>
<use emmett.png>
Underfull \vbox (badness 10000) has occurred while \output is active [6]
[7 <./emmett.png>] [8] <ppc64-with-smt.pdf, id=100, 1154.3125pt x 431.6125pt>
<use ppc64-with-smt.pdf>
<ppc64-without-smt.pdf, id=101, 592.2125pt x 431.6125pt>
<use ppc64-without-smt.pdf>
Underfull \vbox (badness 10000) has occurred while \output is active [9 <./ppc6
4-with-smt.pdf
Warning: /usr/bin/pdflatex (file ./ppc64-with-smt.pdf): pdf inclusion: Page Gro
up detected which pdfTeX can't handle. Ignoring it.
> <./ppc64-without-smt.pdf
Warning: /usr/bin/pdflatex (file ./ppc64-without-smt.pdf): pdf inclusion: Page
Group detected which pdfTeX can't handle. Ignoring it.
>] <ppc64-full-with-smt.pdf, id=127, 913.4125pt x 1355.0625pt>
<use ppc64-full-with-smt.pdf>
Underfull \vbox (badness 10000) has occurred while \output is active [10]
Underfull \vbox (badness 10000) has occurred while \output is active [11 <./ppc
64-full-with-smt.pdf
Warning: /usr/bin/pdflatex (file ./ppc64-full-with-smt.pdf): pdf inclusion: Pag
e Group detected which pdfTeX can't handle. Ignoring it.
>] [12]
Underfull \vbox (badness 10000) has occurred while \output is active [13]
[14]
Overfull \hbox (71.9415pt too wide) in paragraph at lines 623--624
/ptmr8t/Questions should be sent to the de-vel mail-ing list ([][]/pcrr8t/http:
//www.open-mpi.org/community/lists/hwloc.php[][]/ptmr8t/).

Overfull \hbox (59.08203pt too wide) in paragraph at lines 630--631
/ptmr8t/hwloc is the evo-lu-tion and merger of the libtopol-ogy ([][]/pcrr8t/ht
tp://runtime.bordeaux.inria.fr/libtopology/[][]/ptmr8t/)

Overfull \hbox (37.41107pt too wide) in paragraph at lines 630--631
/ptmr8t/project and the Portable Linux Pro-ces-sor Affin-ity (PLPA) ([][]/pcrr8
t/http://www.open-mpi.org/projects/plpa/[][]/ptmr8t/)

Underfull \hbox (badness 10000) in paragraph at lines 632--633
[]/ptmr8t/libtopology was ini-tially de-vel-oped by the IN-RIA Run-time Team-Pr
oject

Underfull \hbox (badness 10000) in paragraph at lines 632--633
/ptmr8t/([][]/pcrr8t/http://runtime.bordeaux.inria.fr/[][]/ptmr8t/) (headed by
Ray-mond Namyst

Underfull \hbox (badness 2035) in paragraph at lines 632--633
/ptmr8t/([][]/pcrr8t/http://dept-info.labri.fr/$/cmsy10/^^X$/pcrr8t/namyst/[][]
/ptmr8t/). PLPA was ini-tially de-vel-oped by the Open
[15] [16] <diagram.pdf, id=188, 672.5125pt x 690.58pt> <use diagram.pdf>
Overfull \hbox (247.9246pt too wide) in paragraph at lines 689--689
 []

Underfull \vbox (badness 10000) has occurred while \output is active [17]
Overfull \vbox (79.74323pt too high) has occurred while \output is active
[18 <./diagram.pdf>] [19] [20] [21] [22]Error: PDF version 1.5 -- xpdf supports version 1.4 (continuing anyway)

Error: /usr/bin/pdflatex (file devel09-pci.pdf): pdf inclusion: found pdf versi
on <1.5>, but at most version <1.4> allowed
 ==> Fatal error occurred, the output PDF file is not finished!
This is makeindex, version 2.14 [02-Oct-2002] (kpathsea + Thai support).
Scanning input file a4-refman.idx...done (0 entries accepted, 0 rejected).
Nothing written in a4-refman.ind.
Transcript written in a4-refman.ilg.
This is pdfTeX, Version 3.14159-1.10b (Web2C 7.4.5)
(./a4-refman.tex{/usr/share/texmf/pdftex/config/pdftex.cfg}
LaTeX2e <2001/06/01>
Babel <v3.7h> and hyphenation patterns for american, french, german, ngerman, n
ohyphenation, loaded.
(/usr/share/texmf/tex/latex/base/book.cls
Document Class: book 2001/04/21 v1.4e Standard LaTeX document class
(/usr/share/texmf/tex/latex/base/bk10.clo))
(/usr/share/texmf/tex/latex/misc/a4wide.sty
(/usr/share/texmf/tex/latex/ntgclass/a4.sty))
(/usr/share/texmf/tex/latex/base/makeidx.sty)
(/usr/share/texmf/tex/latex/fancyhdr/fancyhdr.sty)
(/usr/share/texmf/tex/latex/graphics/graphicx.sty
(/usr/share/texmf/tex/latex/graphics/keyval.sty)
(/usr/share/texmf/tex/latex/graphics/graphics.sty
(/usr/share/texmf/tex/latex/graphics/trig.sty)
(/usr/share/texmf/tex/latex/config/graphics.cfg)
(/usr/share/texmf/tex/latex/graphics/pdftex.def)))
(/usr/share/texmf/tex/latex/tools/multicol.sty)
(/usr/share/texmf/tex/latex/misc/float.sty)
(/usr/share/texmf/tex/latex/base/textcomp.sty
(/usr/share/texmf/tex/latex/base/ts1enc.def))
(/usr/share/texmf/tex/latex/base/alltt.sty)
(/usr/share/texmf/tex/latex/psnfss/times.sty)
(/usr/share/texmf/tex/latex/hyperref/hyperref.sty
(/usr/share/texmf/tex/latex/hyperref/pd1enc.def)
(/usr/share/texmf/tex/latex/config/hyperref.cfg)
Implicit mode ON; LaTeX internals redefined
(/usr/share/texmf/tex/latex/hyperref/backref.sty)
(/usr/share/texmf/tex/latex/html/url.sty))
*hyperref using driver hpdftex*
(/usr/share/texmf/tex/latex/hyperref/hpdftex.def
(/usr/share/texmf/tex/latex/psnfss/pifont.sty
(/usr/share/texmf/tex/latex/psnfss/upzd.fd)
(/usr/share/texmf/tex/latex/psnfss/upsy.fd))) (./doxygen.sty
(/usr/share/texmf/tex/latex/tools/calc.sty)
(/usr/share/texmf/tex/latex/tools/array.sty))
(/usr/share/texmf/tex/latex/base/fontenc.sty
(/usr/share/texmf/tex/latex/base/t1enc.def))
Writing index file a4-refman.idx
(./a4-refman.aux) (/usr/share/texmf/tex/latex/base/ts1cmr.fd)
(/usr/share/texmf/tex/latex/psnfss/t1ptm.fd)
(/usr/share/texmf/tex/context/base/supp-pdf.tex
(/usr/share/texmf/tex/context/base/supp-mis.tex
loading : Context Support Macros / Missing
)
loading : Context Support Macros / PDF
) (/usr/share/texmf/tex/latex/graphics/color.sty
(/usr/share/texmf/tex/latex/config/color.cfg))
(/usr/share/texmf/tex/latex/hyperref/nameref.sty) (./a4-refman.out)
(./a4-refman.out) [1{/usr/share/texmf/dvips/config/pdftex.map}] [2]
(./a4-refman.toc)
! pdfTeX warning (ext4): destination with the same identifier (name{page.1}) ha
s been already used, duplicate ignored
<to be read again>
                   \penalty
l.44 \clearemptydoublepage
                           [1]
! pdfTeX warning (ext4): destination with the same identifier (name{page.2}) ha
s been already used, duplicate ignored
<to be read again>
                   \penalty
l.44 \clearemptydoublepage
                           [2]
Chapter 1.
(./index.tex
Underfull \hbox (badness 10000) in paragraph at lines 1--1
[]/ptmb8t_at_14.4pt/Portable ab-strac-tion of hi-er-ar-chi-cal ar-chi-tec-tures fo
r high-
(/usr/share/texmf/tex/latex/psnfss/ts1ptm.fd)
! pdfTeX warning (ext4): destination with the same identifier (name{page.1}) ha
s been already used, duplicate ignored
<to be read again>
                   \penalty
l.21
      [1] (/usr/share/texmf/tex/latex/psnfss/t1pcr.fd)
! pdfTeX warning (ext4): destination with the same identifier (name{page.2}) ha
s been already used, duplicate ignored
<to be read again>
                   \penalty
l.70
      [2] <dudley.png, id=120, 451.6875pt x 572.1375pt> <use dudley.png>
[3 <./dudley.png>] [4] <hagrid.png, id=130, 973.6375pt x 291.0875pt>
<use hagrid.png>
Overfull \hbox (549.04887pt too wide) in paragraph at lines 194--194
 []
[5 <./hagrid.png>] <emmett.png, id=136, 431.6125pt x 431.6125pt>
<use emmett.png>
Underfull \vbox (badness 10000) has occurred while \output is active [6]
[7 <./emmett.png>] [8] <ppc64-with-smt.pdf, id=159, 1154.3125pt x 431.6125pt>
<use ppc64-with-smt.pdf>
<ppc64-without-smt.pdf, id=160, 592.2125pt x 431.6125pt>
<use ppc64-without-smt.pdf>
Underfull \vbox (badness 10000) has occurred while \output is active [9 <./ppc6
4-with-smt.pdf
Warning: /usr/bin/pdflatex (file ./ppc64-with-smt.pdf): pdf inclusion: Page Gro
up detected which pdfTeX can't handle. Ignoring it.
> <./ppc64-without-smt.pdf
Warning: /usr/bin/pdflatex (file ./ppc64-without-smt.pdf): pdf inclusion: Page
Group detected which pdfTeX can't handle. Ignoring it.
>] <ppc64-full-with-smt.pdf, id=186, 913.4125pt x 1355.0625pt>
<use ppc64-full-with-smt.pdf>
Underfull \vbox (badness 10000) has occurred while \output is active [10]
Underfull \vbox (badness 10000) has occurred while \output is active [11 <./ppc
64-full-with-smt.pdf
Warning: /usr/bin/pdflatex (file ./ppc64-full-with-smt.pdf): pdf inclusion: Pag
e Group detected which pdfTeX can't handle. Ignoring it.
>] [12]
Underfull \vbox (badness 10000) has occurred while \output is active [13]
[14]
Overfull \hbox (71.9415pt too wide) in paragraph at lines 623--624
/ptmr8t/Questions should be sent to the de-vel mail-ing list ([][]/pcrr8t/http:
//www.open-mpi.org/community/lists/hwloc.php[][]/ptmr8t/).

Overfull \hbox (59.08203pt too wide) in paragraph at lines 630--631
/ptmr8t/hwloc is the evo-lu-tion and merger of the libtopol-ogy ([][]/pcrr8t/ht
tp://runtime.bordeaux.inria.fr/libtopology/[][]/ptmr8t/)

Overfull \hbox (37.41107pt too wide) in paragraph at lines 630--631
/ptmr8t/project and the Portable Linux Pro-ces-sor Affin-ity (PLPA) ([][]/pcrr8
t/http://www.open-mpi.org/projects/plpa/[][]/ptmr8t/)

Underfull \hbox (badness 10000) in paragraph at lines 632--633
[]/ptmr8t/libtopology was ini-tially de-vel-oped by the IN-RIA Run-time Team-Pr
oject

Underfull \hbox (badness 10000) in paragraph at lines 632--633
/ptmr8t/([][]/pcrr8t/http://runtime.bordeaux.inria.fr/[][]/ptmr8t/) (headed by
Ray-mond Namyst

Underfull \hbox (badness 2035) in paragraph at lines 632--633
/ptmr8t/([][]/pcrr8t/http://dept-info.labri.fr/$/cmsy10/^^X$/pcrr8t/namyst/[][]
/ptmr8t/). PLPA was ini-tially de-vel-oped by the Open
[15] [16] <diagram.pdf, id=244, 672.5125pt x 690.58pt> <use diagram.pdf>
Overfull \hbox (247.9246pt too wide) in paragraph at lines 689--689
 []

Underfull \vbox (badness 10000) has occurred while \output is active [17]
Overfull \vbox (79.74323pt too high) has occurred while \output is active
[18 <./diagram.pdf>] [19] [20] [21] [22]Error: PDF version 1.5 -- xpdf supports version 1.4 (continuing anyway)

Error: /usr/bin/pdflatex (file devel09-pci.pdf): pdf inclusion: found pdf versi
on <1.5>, but at most version <1.4> allowed
 ==> Fatal error occurred, the output PDF file is not finished!
if test -d doxygen-doc/html -a -f doxygen-doc/html/doxygen.css; then \
    cp -f ./doxygen.css doxygen-doc/html; \
fi
make[3]: Leaving directory `/home/mpiteam/hwloc/nightly-tarball-build-root/trunk/create-r3680/hwloc/doc'
make[2]: Leaving directory `/home/mpiteam/hwloc/nightly-tarball-build-root/trunk/create-r3680/hwloc/doc'
*** Making new README
make[2]: Entering directory `/home/mpiteam/hwloc/nightly-tarball-build-root/trunk/create-r3680/hwloc/doc'
make all-am
make[3]: Entering directory `/home/mpiteam/hwloc/nightly-tarball-build-root/trunk/create-r3680/hwloc/doc'
if test -d doxygen-doc/html -a -f doxygen-doc/html/doxygen.css; then \
    cp -f ./doxygen.css doxygen-doc/html; \
fi
make[3]: Leaving directory `/home/mpiteam/hwloc/nightly-tarball-build-root/trunk/create-r3680/hwloc/doc'
LC_ALL=C /usr/bin/lynx -dump -nolist doxygen-doc/html/index.html | /bin/sed -n -e 's/^ //' -e '/^Introduction$/,$p' > /home/mpiteam/hwloc/nightly-tarball-build-root/trunk/create-r3680/hwloc/README
make[2]: Leaving directory `/home/mpiteam/hwloc/nightly-tarball-build-root/trunk/create-r3680/hwloc/doc'
*** Copying doxygen-doc tree to dist...
*** Directory: srcdir: /home/mpiteam/hwloc/nightly-tarball-build-root/trunk/create-r3680/hwloc, distdir: /home/mpiteam/hwloc/nightly-tarball-build-root/trunk/create-r3680/hwloc/hwloc-1.4a1r3680, pwd: /home/mpiteam/hwloc/nightly-tarball-build-root/trunk/create-r3680/hwloc/doc
rm -rf /home/mpiteam/hwloc/nightly-tarball-build-root/trunk/create-r3680/hwloc/hwloc-1.4a1r3680/doc/doxygen-doc
cp -rpf /home/mpiteam/hwloc/nightly-tarball-build-root/trunk/create-r3680/hwloc/doc/doxygen-doc /home/mpiteam/hwloc/nightly-tarball-build-root/trunk/create-r3680/hwloc/hwloc-1.4a1r3680/doc
*** Copying new README
/home/mpiteam/hwloc/nightly-tarball-build-root/trunk/create-r3680/hwloc/hwloc-1.4a1r3680/README
*** Now in distdir: /home/mpiteam/hwloc/nightly-tarball-build-root/trunk/create-r3680/hwloc/hwloc-1.4a1r3680
*** Removing latex source from dist tree
*** Downloading latest config.sub/config.guess from ftp.gnu.org...
--21:02:07-- http://git.savannah.gnu.org/gitweb/?p=config.git;a=blob_plain;f=config.guess;hb=master
           => `config.guess'
Resolving git.savannah.gnu.org... 140.186.70.72
Connecting to git.savannah.gnu.org|140.186.70.72|:80... connected.
HTTP request sent, awaiting response... 200 OK
Length: unspecified [text/plain]

    0K .......... .......... .......... .......... ... 338.45 KB/s

21:02:07 (338.45 KB/s) - `config.guess' saved [44461]

--21:02:07-- http://git.savannah.gnu.org/gitweb/?p=config.git;a=blob_plain;f=config.sub;hb=master
           => `config.sub'
Resolving git.savannah.gnu.org... 140.186.70.72
Connecting to git.savannah.gnu.org|140.186.70.72|:80... connected.
HTTP request sent, awaiting response... 200 OK
Length: unspecified [text/plain]

    0K .......... .......... .......... .... 270.24 KB/s

21:02:07 (270.24 KB/s) - `config.sub' saved [35328]

 - Got good config.guess and config.sub from ftp.gnu.org
*** hwloc version 1.4a1r3680 distribution created
 
Started: Thu Aug 25 21:01:59 EDT 2011
Ended: Thu Aug 25 21:02:08 EDT 2011
 
make[1]: Leaving directory `/home/mpiteam/hwloc/nightly-tarball-build-root/trunk/create-r3680/hwloc'
test -n "" \
|| find "hwloc-1.4a1r3680" -type d ! -perm -777 -exec chmod a+rwx {} \; -o \
  ! -type d ! -perm -444 -links 1 -exec chmod a+r {} \; -o \
  ! -type d ! -perm -400 -exec chmod a+r {} \; -o \
  ! -type d ! -perm -444 -exec /bin/sh /home/mpiteam/hwloc/nightly-tarball-build-root/trunk/create-r3680/hwloc/config/install-sh -c -m a+r {} {} \; \
|| chmod -R a+r "hwloc-1.4a1r3680"
tardir=hwloc-1.4a1r3680 && tar --format=ustar -chf - "$tardir" | GZIP=--best gzip -c >hwloc-1.4a1r3680.tar.gz
tardir=hwloc-1.4a1r3680 && tar --format=ustar -chf - "$tardir" | bzip2 -9 -c >hwloc-1.4a1r3680.tar.bz2
{ test ! -d "hwloc-1.4a1r3680" || { find "hwloc-1.4a1r3680" -type d ! -perm -200 -exec chmod u+w {} ';' && rm -fr "hwloc-1.4a1r3680"; }; }
case 'hwloc-1.4a1r3680.tar.gz hwloc-1.4a1r3680.tar.bz2' in \
*.tar.gz*) \
  GZIP=--best gunzip -c hwloc-1.4a1r3680.tar.gz | tar -xf - ;;\
*.tar.bz2*) \
  bunzip2 -c hwloc-1.4a1r3680.tar.bz2 | tar -xf - ;;\
*.tar.lzma*) \
  unlzma -c hwloc-1.4a1r3680.tar.lzma | tar -xf - ;;\
*.tar.xz*) \
  xz -dc hwloc-1.4a1r3680.tar.xz | tar -xf - ;;\
*.tar.Z*) \
  uncompress -c hwloc-1.4a1r3680.tar.Z | tar -xf - ;;\
*.shar.gz*) \
  GZIP=--best gunzip -c hwloc-1.4a1r3680.shar.gz | unshar ;;\
*.zip*) \
  unzip hwloc-1.4a1r3680.zip ;;\
esac
chmod -R a-w hwloc-1.4a1r3680; chmod a+w hwloc-1.4a1r3680
mkdir hwloc-1.4a1r3680/_build
mkdir hwloc-1.4a1r3680/_inst
chmod a-w hwloc-1.4a1r3680
test -d hwloc-1.4a1r3680/_build || exit 0; \
dc_install_base=`CDPATH="${ZSH_VERSION+.}:" && cd hwloc-1.4a1r3680/_inst && pwd | sed -e 's,^[^:\\/]:[\\/],/,'` \
  && dc_destdir="${TMPDIR-/tmp}/am-dc-$$/" \
  && am__cwd=`pwd` \
  && CDPATH="${ZSH_VERSION+.}:" && cd hwloc-1.4a1r3680/_build \
  && ../configure --srcdir=.. --prefix="$dc_install_base" \
     \
  && make \
  && make dvi \
  && make check \
  && make install \
  && make installcheck \
  && make uninstall \
  && make distuninstallcheck_dir="$dc_install_base" \
        distuninstallcheck \
  && chmod -R a-w "$dc_install_base" \
  && ({ \
       (cd ../.. && umask 077 && mkdir "$dc_destdir") \
       && make DESTDIR="$dc_destdir" install \
       && make DESTDIR="$dc_destdir" uninstall \
       && make DESTDIR="$dc_destdir" \
            distuninstallcheck_dir="$dc_destdir" distuninstallcheck; \
      } || { rm -rf "$dc_destdir"; exit 1; }) \
  && rm -rf "$dc_destdir" \
  && make dist \
  && rm -rf hwloc-1.4a1r3680.tar.gz hwloc-1.4a1r3680.tar.bz2 \
  && make distcleancheck \
  && cd "$am__cwd" \
  || exit 1

###
### Configuring hwloc distribution tarball
### Startup tests
###
checking build system type... i686-pc-linux-gnu
checking host system type... i686-pc-linux-gnu
checking target system type... i686-pc-linux-gnu
checking for a BSD-compatible install... /usr/bin/install -c
checking whether build environment is sane... yes
checking for a thread-safe mkdir -p... /bin/mkdir -p
checking for gawk... gawk
checking whether make sets $(MAKE)... yes
checking how to create a ustar tar archive... gnutar
checking for hwloc version... 1.4a1r3680
checking for gcc... gcc
checking whether the C compiler works... yes
checking for C compiler default output file name... a.out
checking for suffix of executables...
checking whether we are cross compiling... no
checking for suffix of object files... o
checking whether we are using the GNU C compiler... yes
checking whether gcc accepts -g... yes
checking for gcc option to accept ISO C89... none needed
checking for style of include used by make... GNU
checking dependency style of gcc... gcc3
checking whether gcc and cc understand -c and -o together... yes
checking how to run the C preprocessor... gcc -E
checking for grep that handles long lines and -e... /bin/grep
checking for egrep... /bin/grep -E
checking for ANSI C header files... yes
checking for sys/types.h... yes
checking for sys/stat.h... yes
checking for stdlib.h... yes
checking for string.h... yes
checking for memory.h... yes
checking for strings.h... yes
checking for inttypes.h... yes
checking for stdint.h... yes
checking for unistd.h... yes
checking minix/config.h usability... no
checking minix/config.h presence... no
checking for minix/config.h... no
checking whether it is safe to define __EXTENSIONS__... yes
checking for pkg-config... /usr/bin/pkg-config
checking pkg-config is at least version 0.9.0... yes

###
### Configuring hwloc core
###
checking hwloc building mode... standalone
configure: hwloc builddir: /home/mpiteam/hwloc/nightly-tarball-build-root/trunk/create-r3680/hwloc/hwloc-1.4a1r3680/_build
configure: hwloc srcdir: /home/mpiteam/hwloc/nightly-tarball-build-root/trunk/create-r3680/hwloc/hwloc-1.4a1r3680
configure: Detected VPATH build
checking if want hwloc maintainer support... disabled
checking for hwloc directory prefix... (none)
checking for hwloc symbol prefix... hwloc_
checking size of void *... 4
checking which OS support to include... Linux
checking which CPU support to include... x86_32
checking size of unsigned long... 4
checking size of unsigned int... 4
checking for __attribute__... yes
checking for __attribute__(aligned)... yes
checking for __attribute__(always_inline)... yes
checking for __attribute__(cold)... no
checking for __attribute__(const)... yes
checking for __attribute__(deprecated)... yes
checking for __attribute__(format)... no
checking for __attribute__(hot)... no
checking for __attribute__(malloc)... yes
checking for __attribute__(may_alias)... yes
checking for __attribute__(no_instrument_function)... yes
checking for __attribute__(nonnull)... no
checking for __attribute__(noreturn)... yes
checking for __attribute__(packed)... yes
checking for __attribute__(pure)... yes
checking for __attribute__(sentinel)... no
checking for __attribute__(unused)... yes
checking for __attribute__(warn_unused_result)... yes
checking for __attribute__(weak_alias)... yes
checking if gcc supports -fvisibility... yes
checking whether to enable visibility... yes (via -fvisibility=hidden)
configure: WARNING: " -fvisibility=hidden" has been added to the hwloc CFLAGS
checking for inline compatibility keyword... __inline__
checking for strncasecmp... yes
checking whether function strncasecmp is declared... yes
checking for strftime... yes
checking for setlocale... yes
checking for stdint.h... (cached) yes
checking sys/mman.h usability... yes
checking sys/mman.h presence... yes
checking for sys/mman.h... yes
checking for KAFFINITY... no
checking for PROCESSOR_CACHE_TYPE... no
checking for CACHE_DESCRIPTOR... no
checking for LOGICAL_PROCESSOR_RELATIONSHIP... no
checking for RelationProcessorPackage... no
checking for SYSTEM_LOGICAL_PROCESSOR_INFORMATION... no
checking for GROUP_AFFINITY... no
checking for PROCESSOR_RELATIONSHIP... no
checking for NUMA_NODE_RELATIONSHIP... no
checking for CACHE_RELATIONSHIP... no
checking for PROCESSOR_GROUP_INFO... no
checking for GROUP_RELATIONSHIP... no
checking for SYSTEM_LOGICAL_PROCESSOR_INFORMATION_EX... no
checking for PSAPI_WORKING_SET_EX_BLOCK... no
checking for PSAPI_WORKING_SET_EX_INFORMATION... no
checking for main in -lgdi32... no
checking windows.h usability... no
checking windows.h presence... no
checking for windows.h... no
checking sys/lgrp_user.h usability... no
checking sys/lgrp_user.h presence... no
checking for sys/lgrp_user.h... no
checking kstat.h usability... no
checking kstat.h presence... no
checking for kstat.h... no
checking whether _SC_NPROCESSORS_ONLN is declared... yes
checking whether _SC_NPROCESSORS_CONF is declared... yes
checking whether _SC_NPROC_ONLN is declared... no
checking whether _SC_NPROC_CONF is declared... no
checking whether _SC_LARGE_PAGESIZE is declared... no
checking mach/mach_host.h usability... no
checking mach/mach_host.h presence... no
checking for mach/mach_host.h... no
checking mach/mach_init.h usability... no
checking mach/mach_init.h presence... no
checking for mach/mach_init.h... no
checking sys/param.h usability... yes
checking sys/param.h presence... yes
checking for sys/param.h... yes
checking for sys/sysctl.h... yes
checking whether CTL_HW is declared... no
checking whether HW_NCPU is declared... no
checking for sysctl... yes
checking for sysctlbyname... no
checking for pthread_t... yes
checking whether function sched_setaffinity is declared... yes
checking for old prototype of sched_setaffinity... no
checking for working CPU_SET... yes
checking for working CPU_SET_S... no
checking for working _syscall3... yes
checking for KERRIGHED... no
checking for lib... no
checking for bash... /bin/sh
checking for ffs... yes
checking whether function ffs is declared... yes
checking for ffsl... yes
checking whether function ffsl is declared... yes
checking for fls... no
checking for flsl... no
checking for clz... no
checking for clzl... no
checking for openat... no
checking malloc.h usability... yes
checking malloc.h presence... yes
checking for malloc.h... yes
checking for getpagesize... yes
checking for memalign... yes
checking for posix_memalign... yes
checking sys/utsname.h usability... yes
checking sys/utsname.h presence... yes
checking for sys/utsname.h... yes
checking for uname... yes
checking numaif.h usability... yes
checking numaif.h presence... yes
checking for numaif.h... yes
checking for set_mempolicy in -lnuma... yes
checking for mbind in -lnuma... yes
checking for migrate_pages in -lnuma... no
checking pthread_np.h usability... no
checking pthread_np.h presence... no
checking for pthread_np.h... no
checking whether pthread_setaffinity_np is declared... no
checking whether pthread_getaffinity_np is declared... no
checking for sched_setaffinity... yes
checking for sys/cpuset.h... no
checking for library containing pthread_getthrds_np... no
checking for PCI... no
checking pci/pci.h usability... yes
checking pci/pci.h presence... yes
checking for pci/pci.h... yes
checking for pci_init in -lpci... yes
checking for pci_lookup_name in -lpci... yes
checking whether PCI_LOOKUP_NO_NUMBERS is declared... no
checking for pci_find_cap in -lpci... no
checking whether struct pci_dev has a device_class field... yes
checking whether struct pci_dev has a domain field... yes
checking for XML... yes
checking for xmlNewDoc... yes
checking for final XML support... yes
checking for cpuid... yes
checking for X... libraries /usr/X11R6/lib, headers

###
### Configuring hwloc documentation
###
checking if this is a developer build... no (doxygen generation is optional)
checking for doxygen... /usr/bin/doxygen
checking for pdflatex... /usr/bin/pdflatex
checking for makeindex... /usr/bin/makeindex
checking for fig2dev... /usr/bin/fig2dev
checking for gs... /usr/bin/gs
checking for epstopdf... /usr/bin/epstopdf
checking if can build doxygen docs... yes
checking for a sed that does not truncate output... /bin/sed
checking if the sed -i option requires an argument... no
checking for w3m... no
checking for lynx... /usr/bin/lynx
checking if can build top-level README... yes
checking if will build doxygen docs... yes
checking if will install doxygen docs... yes
checking whether to enable "picky" compiler mode... no (default)

###
### Configuring hwloc command line utilities
###
checking for CAIRO... no
checking for wchar_t... yes
checking for putwc... yes
checking locale.h usability... yes
checking locale.h presence... yes
checking for locale.h... yes
checking for setlocale... (cached) yes
checking langinfo.h usability... yes
checking langinfo.h presence... yes
checking for langinfo.h... yes
checking for nl_langinfo... yes
checking termcap support using ncurses and ... no
checking termcap support using ncurses and -ltermcap... no
checking termcap support using ncurses and -lncursesw... yes
checking whether diff accepts -u... -u

###
### Configuring hwloc tests
###
checking whether numa_bitmask_alloc is declared... no
checking infiniband/verbs.h usability... no
checking infiniband/verbs.h presence... no
checking for infiniband/verbs.h... no
checking myriexpress.h usability... no
checking myriexpress.h presence... no
checking for myriexpress.h... no
checking cuda.h usability... no
checking cuda.h presence... no
checking for cuda.h... no
checking cuda_runtime_api.h usability... no
checking cuda_runtime_api.h presence... no
checking for cuda_runtime_api.h... no
checking for xmllint... xmllint
checking for bunzip2... bunzip2
checking whether diff accepts -u... -u
checking for a sed that does not truncate output... (cached) /bin/sed
checking for fgrep... /bin/grep -F
checking for ld used by gcc... /usr/bin/ld
checking if the linker (/usr/bin/ld) is GNU ld... yes
checking for BSD- or MS-compatible name lister (nm)... /usr/bin/nm -B
checking the name lister (/usr/bin/nm -B) interface... BSD nm
checking whether ln -s works... yes
checking the maximum length of command line arguments... 98304
checking whether the shell understands some XSI constructs... yes
checking whether the shell understands "+="... no
checking for /usr/bin/ld option to reload object files... -r
checking for objdump... objdump
checking how to recognize dependent libraries... pass_all
checking for ar... ar
checking for strip... strip
checking for ranlib... ranlib
checking command to parse /usr/bin/nm -B output from gcc object... ok
checking for dlfcn.h... yes
checking for objdir... .libs
checking if gcc supports -fno-rtti -fno-exceptions... no
checking for gcc option to produce PIC... -fPIC -DPIC
checking if gcc PIC flag -fPIC -DPIC works... yes
checking if gcc static flag -static works... yes
checking if gcc supports -c -o file.o... yes
checking if gcc supports -c -o file.o... (cached) yes
checking whether the gcc linker (/usr/bin/ld) supports shared libraries... yes
checking whether -lc should be explicitly linked in... no
checking dynamic linker characteristics... GNU/Linux ld.so
checking how to hardcode library paths into programs... immediate
checking whether stripping libraries is possible... yes
checking if libtool supports shared libraries... yes
checking whether to build shared libraries... yes
checking whether to build static libraries... no
configure: creating ./config.status
config.status: creating Makefile
config.status: creating include/Makefile
config.status: creating src/Makefile
config.status: creating doc/Makefile
config.status: creating doc/doxygen-config.cfg
config.status: creating utils/Makefile
config.status: creating hwloc.pc
config.status: creating tests/Makefile
config.status: creating tests/linux/Makefile
config.status: creating tests/linux/gather/Makefile
config.status: creating tests/xml/Makefile
config.status: creating tests/ports/Makefile
config.status: creating tests/linux/hwloc-gather-topology
config.status: creating tests/linux/gather/test-gather-topology.sh
config.status: creating tests/linux/test-topology.sh
config.status: creating tests/xml/test-topology.sh
config.status: creating utils/test-hwloc-calc.sh
config.status: creating utils/test-hwloc-distrib.sh
config.status: creating include/private/autogen/config.h
config.status: creating include/hwloc/autogen/config.h
config.status: linking ../src/topology.c to tests/ports/topology.c
config.status: linking ../src/traversal.c to tests/ports/traversal.c
config.status: linking ../src/topology-synthetic.c to tests/ports/topology-synthetic.c
config.status: linking ../src/topology-solaris.c to tests/ports/topology-solaris.c
config.status: linking ../src/topology-aix.c to tests/ports/topology-aix.c
config.status: linking ../src/topology-osf.c to tests/ports/topology-osf.c
config.status: linking ../src/topology-windows.c to tests/ports/topology-windows.c
config.status: linking ../src/topology-darwin.c to tests/ports/topology-darwin.c
config.status: linking ../src/topology-freebsd.c to tests/ports/topology-freebsd.c
config.status: linking ../src/topology-hpux.c to tests/ports/topology-hpux.c
config.status: executing depfiles commands
config.status: executing chmoding-scripts commands
config.status: executing libtool commands
make[1]: Entering directory `/home/mpiteam/hwloc/nightly-tarball-build-root/trunk/create-r3680/hwloc/hwloc-1.4a1r3680/_build'
Making all in src
make[2]: Entering directory `/home/mpiteam/hwloc/nightly-tarball-build-root/trunk/create-r3680/hwloc/hwloc-1.4a1r3680/_build/src'
  CC topology.lo
  CC traversal.lo
  CC distances.lo
  CC topology-synthetic.lo
  CC bind.lo
  CC cpuset.lo
  CC misc.lo
  CC topology-xml.lo
  CC topology-libpci.lo
  CC topology-linux.lo
  CC topology-x86.lo
  CCLD libhwloc.la
make[2]: Leaving directory `/home/mpiteam/hwloc/nightly-tarball-build-root/trunk/create-r3680/hwloc/hwloc-1.4a1r3680/_build/src'
Making all in include
make[2]: Entering directory `/home/mpiteam/hwloc/nightly-tarball-build-root/trunk/create-r3680/hwloc/hwloc-1.4a1r3680/_build/include'
make[2]: Nothing to be done for `all'.
make[2]: Leaving directory `/home/mpiteam/hwloc/nightly-tarball-build-root/trunk/create-r3680/hwloc/hwloc-1.4a1r3680/_build/include'
Making all in utils
make[2]: Entering directory `/home/mpiteam/hwloc/nightly-tarball-build-root/trunk/create-r3680/hwloc/hwloc-1.4a1r3680/_build/utils'
  CC lstopo-lstopo.o
  CC lstopo-lstopo-color.o
  CC lstopo-lstopo-text.o
  CC lstopo-lstopo-draw.o
  CC lstopo-lstopo-fig.o
  CC lstopo-lstopo-cairo.o
  CC lstopo-lstopo-xml.o
  CCLD lstopo
  CC hwloc-calc.o
  CCLD hwloc-calc
  CC hwloc-bind.o
  CCLD hwloc-bind
  CC hwloc-distrib.o
  CCLD hwloc-distrib
  CC hwloc-ps.o
  CCLD hwloc-ps
Creating hwloc.7 man page...
Creating lstopo.1 man page...
Creating hwloc-bind.1 man page...
Creating hwloc-distrib.1 man page...
Creating hwloc-calc.1 man page...
Creating hwloc-ps.1 man page...
Creating hwloc-gather-topology.1 man page...
make[2]: Leaving directory `/home/mpiteam/hwloc/nightly-tarball-build-root/trunk/create-r3680/hwloc/hwloc-1.4a1r3680/_build/utils'
Making all in tests
make[2]: Entering directory `/home/mpiteam/hwloc/nightly-tarball-build-root/trunk/create-r3680/hwloc/hwloc-1.4a1r3680/_build/tests'
Making all in ports
make[3]: Entering directory `/home/mpiteam/hwloc/nightly-tarball-build-root/trunk/create-r3680/hwloc/hwloc-1.4a1r3680/_build/tests/ports'
make[3]: Nothing to be done for `all'.
make[3]: Leaving directory `/home/mpiteam/hwloc/nightly-tarball-build-root/trunk/create-r3680/hwloc/hwloc-1.4a1r3680/_build/tests/ports'
Making all in xml
make[3]: Entering directory `/home/mpiteam/hwloc/nightly-tarball-build-root/trunk/create-r3680/hwloc/hwloc-1.4a1r3680/_build/tests/xml'
make[3]: Nothing to be done for `all'.
make[3]: Leaving directory `/home/mpiteam/hwloc/nightly-tarball-build-root/trunk/create-r3680/hwloc/hwloc-1.4a1r3680/_build/tests/xml'
Making all in linux
make[3]: Entering directory `/home/mpiteam/hwloc/nightly-tarball-build-root/trunk/create-r3680/hwloc/hwloc-1.4a1r3680/_build/tests/linux'
Making all in gather
make[4]: Entering directory `/home/mpiteam/hwloc/nightly-tarball-build-root/trunk/create-r3680/hwloc/hwloc-1.4a1r3680/_build/tests/linux/gather'
make[4]: Nothing to be done for `all'.
make[4]: Leaving directory `/home/mpiteam/hwloc/nightly-tarball-build-root/trunk/create-r3680/hwloc/hwloc-1.4a1r3680/_build/tests/linux/gather'
make[4]: Entering directory `/home/mpiteam/hwloc/nightly-tarball-build-root/trunk/create-r3680/hwloc/hwloc-1.4a1r3680/_build/tests/linux'
make[4]: Nothing to be done for `all-am'.
make[4]: Leaving directory `/home/mpiteam/hwloc/nightly-tarball-build-root/trunk/create-r3680/hwloc/hwloc-1.4a1r3680/_build/tests/linux'
make[3]: Leaving directory `/home/mpiteam/hwloc/nightly-tarball-build-root/trunk/create-r3680/hwloc/hwloc-1.4a1r3680/_build/tests/linux'
make[3]: Entering directory `/home/mpiteam/hwloc/nightly-tarball-build-root/trunk/create-r3680/hwloc/hwloc-1.4a1r3680/_build/tests'
make[3]: Nothing to be done for `all-am'.
make[3]: Leaving directory `/home/mpiteam/hwloc/nightly-tarball-build-root/trunk/create-r3680/hwloc/hwloc-1.4a1r3680/_build/tests'
make[2]: Leaving directory `/home/mpiteam/hwloc/nightly-tarball-build-root/trunk/create-r3680/hwloc/hwloc-1.4a1r3680/_build/tests'
Making all in doc
make[2]: Entering directory `/home/mpiteam/hwloc/nightly-tarball-build-root/trunk/create-r3680/hwloc/hwloc-1.4a1r3680/_build/doc'
make all-am
make[3]: Entering directory `/home/mpiteam/hwloc/nightly-tarball-build-root/trunk/create-r3680/hwloc/hwloc-1.4a1r3680/_build/doc'
if test -d doxygen-doc/html -a -f doxygen-doc/html/doxygen.css; then \
    cp -f ../../doc/doxygen.css doxygen-doc/html; \
fi
make[3]: Leaving directory `/home/mpiteam/hwloc/nightly-tarball-build-root/trunk/create-r3680/hwloc/hwloc-1.4a1r3680/_build/doc'
make[2]: Leaving directory `/home/mpiteam/hwloc/nightly-tarball-build-root/trunk/create-r3680/hwloc/hwloc-1.4a1r3680/_build/doc'
make[2]: Entering directory `/home/mpiteam/hwloc/nightly-tarball-build-root/trunk/create-r3680/hwloc/hwloc-1.4a1r3680/_build'
make[2]: Nothing to be done for `all-am'.
make[2]: Leaving directory `/home/mpiteam/hwloc/nightly-tarball-build-root/trunk/create-r3680/hwloc/hwloc-1.4a1r3680/_build'
make[1]: Leaving directory `/home/mpiteam/hwloc/nightly-tarball-build-root/trunk/create-r3680/hwloc/hwloc-1.4a1r3680/_build'
make[1]: Entering directory `/home/mpiteam/hwloc/nightly-tarball-build-root/trunk/create-r3680/hwloc/hwloc-1.4a1r3680/_build'
Making dvi in src
make[2]: Entering directory `/home/mpiteam/hwloc/nightly-tarball-build-root/trunk/create-r3680/hwloc/hwloc-1.4a1r3680/_build/src'
make[2]: Nothing to be done for `dvi'.
make[2]: Leaving directory `/home/mpiteam/hwloc/nightly-tarball-build-root/trunk/create-r3680/hwloc/hwloc-1.4a1r3680/_build/src'
Making dvi in include
make[2]: Entering directory `/home/mpiteam/hwloc/nightly-tarball-build-root/trunk/create-r3680/hwloc/hwloc-1.4a1r3680/_build/include'
make[2]: Nothing to be done for `dvi'.
make[2]: Leaving directory `/home/mpiteam/hwloc/nightly-tarball-build-root/trunk/create-r3680/hwloc/hwloc-1.4a1r3680/_build/include'
Making dvi in utils
make[2]: Entering directory `/home/mpiteam/hwloc/nightly-tarball-build-root/trunk/create-r3680/hwloc/hwloc-1.4a1r3680/_build/utils'
make[2]: Nothing to be done for `dvi'.
make[2]: Leaving directory `/home/mpiteam/hwloc/nightly-tarball-build-root/trunk/create-r3680/hwloc/hwloc-1.4a1r3680/_build/utils'
Making dvi in tests
make[2]: Entering directory `/home/mpiteam/hwloc/nightly-tarball-build-root/trunk/create-r3680/hwloc/hwloc-1.4a1r3680/_build/tests'
Making dvi in ports
make[3]: Entering directory `/home/mpiteam/hwloc/nightly-tarball-build-root/trunk/create-r3680/hwloc/hwloc-1.4a1r3680/_build/tests/ports'
make[3]: Nothing to be done for `dvi'.
make[3]: Leaving directory `/home/mpiteam/hwloc/nightly-tarball-build-root/trunk/create-r3680/hwloc/hwloc-1.4a1r3680/_build/tests/ports'
Making dvi in xml
make[3]: Entering directory `/home/mpiteam/hwloc/nightly-tarball-build-root/trunk/create-r3680/hwloc/hwloc-1.4a1r3680/_build/tests/xml'
make[3]: Nothing to be done for `dvi'.
make[3]: Leaving directory `/home/mpiteam/hwloc/nightly-tarball-build-root/trunk/create-r3680/hwloc/hwloc-1.4a1r3680/_build/tests/xml'
Making dvi in linux
make[3]: Entering directory `/home/mpiteam/hwloc/nightly-tarball-build-root/trunk/create-r3680/hwloc/hwloc-1.4a1r3680/_build/tests/linux'
Making dvi in gather
make[4]: Entering directory `/home/mpiteam/hwloc/nightly-tarball-build-root/trunk/create-r3680/hwloc/hwloc-1.4a1r3680/_build/tests/linux/gather'
make[4]: Nothing to be done for `dvi'.
make[4]: Leaving directory `/home/mpiteam/hwloc/nightly-tarball-build-root/trunk/create-r3680/hwloc/hwloc-1.4a1r3680/_build/tests/linux/gather'
make[4]: Entering directory `/home/mpiteam/hwloc/nightly-tarball-build-root/trunk/create-r3680/hwloc/hwloc-1.4a1r3680/_build/tests/linux'
make[4]: Nothing to be done for `dvi-am'.
make[4]: Leaving directory `/home/mpiteam/hwloc/nightly-tarball-build-root/trunk/create-r3680/hwloc/hwloc-1.4a1r3680/_build/tests/linux'
make[3]: Leaving directory `/home/mpiteam/hwloc/nightly-tarball-build-root/trunk/create-r3680/hwloc/hwloc-1.4a1r3680/_build/tests/linux'
make[3]: Entering directory `/home/mpiteam/hwloc/nightly-tarball-build-root/trunk/create-r3680/hwloc/hwloc-1.4a1r3680/_build/tests'
make[3]: Nothing to be done for `dvi-am'.
make[3]: Leaving directory `/home/mpiteam/hwloc/nightly-tarball-build-root/trunk/create-r3680/hwloc/hwloc-1.4a1r3680/_build/tests'
make[2]: Leaving directory `/home/mpiteam/hwloc/nightly-tarball-build-root/trunk/create-r3680/hwloc/hwloc-1.4a1r3680/_build/tests'
Making dvi in doc
make[2]: Entering directory `/home/mpiteam/hwloc/nightly-tarball-build-root/trunk/create-r3680/hwloc/hwloc-1.4a1r3680/_build/doc'
make[2]: Nothing to be done for `dvi'.
make[2]: Leaving directory `/home/mpiteam/hwloc/nightly-tarball-build-root/trunk/create-r3680/hwloc/hwloc-1.4a1r3680/_build/doc'
make[2]: Entering directory `/home/mpiteam/hwloc/nightly-tarball-build-root/trunk/create-r3680/hwloc/hwloc-1.4a1r3680/_build'
make[2]: Nothing to be done for `dvi-am'.
make[2]: Leaving directory `/home/mpiteam/hwloc/nightly-tarball-build-root/trunk/create-r3680/hwloc/hwloc-1.4a1r3680/_build'
make[1]: Leaving directory `/home/mpiteam/hwloc/nightly-tarball-build-root/trunk/create-r3680/hwloc/hwloc-1.4a1r3680/_build'
make[1]: Entering directory `/home/mpiteam/hwloc/nightly-tarball-build-root/trunk/create-r3680/hwloc/hwloc-1.4a1r3680/_build'
Making check in src
make[2]: Entering directory `/home/mpiteam/hwloc/nightly-tarball-build-root/trunk/create-r3680/hwloc/hwloc-1.4a1r3680/_build/src'
make[2]: Nothing to be done for `check'.
make[2]: Leaving directory `/home/mpiteam/hwloc/nightly-tarball-build-root/trunk/create-r3680/hwloc/hwloc-1.4a1r3680/_build/src'
Making check in include
make[2]: Entering directory `/home/mpiteam/hwloc/nightly-tarball-build-root/trunk/create-r3680/hwloc/hwloc-1.4a1r3680/_build/include'
make[2]: Nothing to be done for `check'.
make[2]: Leaving directory `/home/mpiteam/hwloc/nightly-tarball-build-root/trunk/create-r3680/hwloc/hwloc-1.4a1r3680/_build/include'
Making check in utils
make[2]: Entering directory `/home/mpiteam/hwloc/nightly-tarball-build-root/trunk/create-r3680/hwloc/hwloc-1.4a1r3680/_build/utils'
make check-TESTS
make[3]: Entering directory `/home/mpiteam/hwloc/nightly-tarball-build-root/trunk/create-r3680/hwloc/hwloc-1.4a1r3680/_build/utils'
PASS: test-hwloc-calc.sh
PASS: test-hwloc-distrib.sh
==================
All 2 tests passed
==================
make[3]: Leaving directory `/home/mpiteam/hwloc/nightly-tarball-build-root/trunk/create-r3680/hwloc/hwloc-1.4a1r3680/_build/utils'
make[2]: Leaving directory `/home/mpiteam/hwloc/nightly-tarball-build-root/trunk/create-r3680/hwloc/hwloc-1.4a1r3680/_build/utils'
Making check in tests
make[2]: Entering directory `/home/mpiteam/hwloc/nightly-tarball-build-root/trunk/create-r3680/hwloc/hwloc-1.4a1r3680/_build/tests'
Making check in ports
make[3]: Entering directory `/home/mpiteam/hwloc/nightly-tarball-build-root/trunk/create-r3680/hwloc/hwloc-1.4a1r3680/_build/tests/ports'
make libhwloc-ports.la
make[4]: Entering directory `/home/mpiteam/hwloc/nightly-tarball-build-root/trunk/create-r3680/hwloc/hwloc-1.4a1r3680/_build/tests/ports'
  CC libhwloc_ports_la-topology.lo
  CC libhwloc_ports_la-traversal.lo
  CC libhwloc_ports_la-topology-synthetic.lo
  CC libhwloc_ports_la-topology-solaris.lo
  CC libhwloc_ports_la-topology-aix.lo
  CC libhwloc_ports_la-topology-osf.lo
  CC libhwloc_ports_la-topology-windows.lo
topology-windows.c: In function `hwloc_win_get_VirtualAllocExNumaProc':
topology-windows.c:323: warning: assignment from incompatible pointer type
topology-windows.c:328: warning: assignment from incompatible pointer type
  CC libhwloc_ports_la-topology-darwin.lo
  CC libhwloc_ports_la-topology-freebsd.lo
  CC libhwloc_ports_la-topology-hpux.lo
  CCLD libhwloc-ports.la
make[4]: Leaving directory `/home/mpiteam/hwloc/nightly-tarball-build-root/trunk/create-r3680/hwloc/hwloc-1.4a1r3680/_build/tests/ports'
make[3]: Leaving directory `/home/mpiteam/hwloc/nightly-tarball-build-root/trunk/create-r3680/hwloc/hwloc-1.4a1r3680/_build/tests/ports'
Making check in xml
make[3]: Entering directory `/home/mpiteam/hwloc/nightly-tarball-build-root/trunk/create-r3680/hwloc/hwloc-1.4a1r3680/_build/tests/xml'
make check-TESTS
make[4]: Entering directory `/home/mpiteam/hwloc/nightly-tarball-build-root/trunk/create-r3680/hwloc/hwloc-1.4a1r3680/_build/tests/xml'
PASS: 16amd64-8n2c-cpusets.xml
PASS: 16em64t-4s2c2t.xml
PASS: 16em64t-4s2c2t-offlines.xml
PASS: 24em64t-2n6c2t-pci.xml
PASS: 8em64t-2mi2ma2c.xml
==================
All 5 tests passed
==================
make[4]: Leaving directory `/home/mpiteam/hwloc/nightly-tarball-build-root/trunk/create-r3680/hwloc/hwloc-1.4a1r3680/_build/tests/xml'
make[3]: Leaving directory `/home/mpiteam/hwloc/nightly-tarball-build-root/trunk/create-r3680/hwloc/hwloc-1.4a1r3680/_build/tests/xml'
Making check in linux
make[3]: Entering directory `/home/mpiteam/hwloc/nightly-tarball-build-root/trunk/create-r3680/hwloc/hwloc-1.4a1r3680/_build/tests/linux'
Making check in gather
make[4]: Entering directory `/home/mpiteam/hwloc/nightly-tarball-build-root/trunk/create-r3680/hwloc/hwloc-1.4a1r3680/_build/tests/linux/gather'
make check-TESTS
make[5]: Entering directory `/home/mpiteam/hwloc/nightly-tarball-build-root/trunk/create-r3680/hwloc/hwloc-1.4a1r3680/_build/tests/linux/gather'
==================
All 0 tests passed
==================
make[5]: Leaving directory `/home/mpiteam/hwloc/nightly-tarball-build-root/trunk/create-r3680/hwloc/hwloc-1.4a1r3680/_build/tests/linux/gather'
make[4]: Leaving directory `/home/mpiteam/hwloc/nightly-tarball-build-root/trunk/create-r3680/hwloc/hwloc-1.4a1r3680/_build/tests/linux/gather'
make[4]: Entering directory `/home/mpiteam/hwloc/nightly-tarball-build-root/trunk/create-r3680/hwloc/hwloc-1.4a1r3680/_build/tests/linux'
make check-TESTS
make[5]: Entering directory `/home/mpiteam/hwloc/nightly-tarball-build-root/trunk/create-r3680/hwloc/hwloc-1.4a1r3680/_build/tests/linux'
==================
All 0 tests passed
==================
make[5]: Leaving directory `/home/mpiteam/hwloc/nightly-tarball-build-root/trunk/create-r3680/hwloc/hwloc-1.4a1r3680/_build/tests/linux'
make[4]: Leaving directory `/home/mpiteam/hwloc/nightly-tarball-build-root/trunk/create-r3680/hwloc/hwloc-1.4a1r3680/_build/tests/linux'
make[3]: Leaving directory `/home/mpiteam/hwloc/nightly-tarball-build-root/trunk/create-r3680/hwloc/hwloc-1.4a1r3680/_build/tests/linux'
make[3]: Entering directory `/home/mpiteam/hwloc/nightly-tarball-build-root/trunk/create-r3680/hwloc/hwloc-1.4a1r3680/_build/tests'
make hwloc_bitmap hwloc_bitmap_string hwloc_get_closest_objs hwloc_get_obj_covering_cpuset hwloc_get_cache_covering_cpuset hwloc_get_largest_objs_inside_cpuset hwloc_get_next_obj_covering_cpuset hwloc_get_obj_inside_cpuset hwloc_get_shared_cache_covering_obj hwloc_get_obj_below_array_by_type hwloc_bitmap_first_last_weight hwloc_bitmap_singlify hwloc_type_depth hwloc_bind hwloc_get_last_cpu_location hwloc_object_userdata hwloc_synthetic hwloc_backends hwloc_is_thissystem hwloc_distances hwloc_set_distances hwloc_groups hwloc_insert_misc hwloc_topology_restrict hwloc_obj_infos hwloc_iodevs glibc-sched xmlbuffer
make[4]: Entering directory `/home/mpiteam/hwloc/nightly-tarball-build-root/trunk/create-r3680/hwloc/hwloc-1.4a1r3680/_build/tests'
  CC hwloc_bitmap.o
  CCLD hwloc_bitmap
  CC hwloc_bitmap_string.o
  CCLD hwloc_bitmap_string
  CC hwloc_get_closest_objs.o
  CCLD hwloc_get_closest_objs
  CC hwloc_get_obj_covering_cpuset.o
  CCLD hwloc_get_obj_covering_cpuset
  CC hwloc_get_cache_covering_cpuset.o
  CCLD hwloc_get_cache_covering_cpuset
  CC hwloc_get_largest_objs_inside_cpuset.o
  CCLD hwloc_get_largest_objs_inside_cpuset
  CC hwloc_get_next_obj_covering_cpuset.o
  CCLD hwloc_get_next_obj_covering_cpuset
  CC hwloc_get_obj_inside_cpuset.o
  CCLD hwloc_get_obj_inside_cpuset
  CC hwloc_get_shared_cache_covering_obj.o
  CCLD hwloc_get_shared_cache_covering_obj
  CC hwloc_get_obj_below_array_by_type.o
  CCLD hwloc_get_obj_below_array_by_type
  CC hwloc_bitmap_first_last_weight.o
  CCLD hwloc_bitmap_first_last_weight
  CC hwloc_bitmap_singlify.o
  CCLD hwloc_bitmap_singlify
  CC hwloc_type_depth.o
  CCLD hwloc_type_depth
  CC hwloc_bind.o
  CCLD hwloc_bind
  CC hwloc_get_last_cpu_location.o
  CCLD hwloc_get_last_cpu_location
  CC hwloc_object_userdata.o
  CCLD hwloc_object_userdata
  CC hwloc_synthetic.o
  CCLD hwloc_synthetic
  CC hwloc_backends.o
  CCLD hwloc_backends
hwloc_backends.o(.text+0x79): In function `main':
: warning: the use of `mktemp' is dangerous, better use `mkstemp'
  CC hwloc_is_thissystem.o
  CCLD hwloc_is_thissystem
  CC hwloc_distances.o
  CCLD hwloc_distances
  CC hwloc_set_distances.o
  CCLD hwloc_set_distances
  CC hwloc_groups.o
  CCLD hwloc_groups
  CC hwloc_insert_misc.o
  CCLD hwloc_insert_misc
  CC hwloc_topology_restrict.o
  CCLD hwloc_topology_restrict
  CC hwloc_obj_infos.o
  CCLD hwloc_obj_infos
  CC hwloc_iodevs.o
  CCLD hwloc_iodevs
  CC glibc-sched.o
  CCLD glibc-sched
  CC xmlbuffer.o
  CCLD xmlbuffer
make[4]: Leaving directory `/home/mpiteam/hwloc/nightly-tarball-build-root/trunk/create-r3680/hwloc/hwloc-1.4a1r3680/_build/tests'
make check-TESTS
make[4]: Entering directory `/home/mpiteam/hwloc/nightly-tarball-build-root/trunk/create-r3680/hwloc/hwloc-1.4a1r3680/_build/tests'
PASS: hwloc_bitmap
empty cpuset converted back and forth, ok
full cpuset converted back and forth, ok
infinite/nonfull cpuset converted back and forth, ok
finite/nonnull cpuset converted back and forth, ok
system cpuset is 0x0000ffff,0xffffffff,0xffffffff,0xffffffff,0xffffffff,0xffffffff,0xffffffff,0xffffffff,0xffffffff,0xffffffff,0xffffffff,0xffffffff,0xffffffff,0xffffffff,0xffffffff,0xffffffff,0xffffffff,0xffffffff,0xffffffff,0xffffffff,0xffffffff,0xffffffff,0xffffffff
system cpuset converted back and forth, ok
truncating system cpuset to NULL buffer
truncating system cpuset to 0 char (no modification)
truncating system cpuset to 1 char (empty string)
got
truncating system cpuset to 10 chars (single 32bit subset except last char)
got 0x0000fff
truncating system cpuset to 11 chars (single 32bit subset)
got 0x0000ffff
truncating system cpuset to 23 chars (two 32bit subsets with ending comma)
got 0x0000ffff,0xffffffff,
truncating system cpuset to 51 chars (truncate to four and a half 32bit subsets)
got 0x0000ffff,0xffffffff,0xffffffff,0xffffffff,0xffff
first cpu cpuset is 0x00000001
first cpu cpuset converted back and forth, ok
last cpu cpuset is 0x00008000,,,,,,,,,,,,,,,,,,,,,,0x0
last cpu cpuset converted back and forth, ok
PASS: hwloc_bitmap_string
looked for 120 closest entries, found 119
ancestor type 1 depth 0 number 0 is system level
PASS: hwloc_get_closest_objs
found covering object type Socket covering cpuset 0x0,0x0fff,0xf0000000
covering object of 0x0,0x0fff,0xf0000000 is 0x0000ffff,0xff000000, expected 0x0000ffff,0xff000000
found system as covering object of first+last cpus cpuset 0x8000,,,,,,,,,,,,,,,,,,,,,,0x1
found no covering object for too-large cpuset 0x10000,,,,,,,,,,,,,,,,,,,,,,0x0
PASS: hwloc_get_obj_covering_cpuset
PASS: hwloc_get_cache_covering_cpuset
PASS: hwloc_get_largest_objs_inside_cpuset
PASS: hwloc_get_next_obj_covering_cpuset
PASS: hwloc_get_obj_inside_cpuset
PASS: hwloc_get_shared_cache_covering_obj
PASS: hwloc_get_obj_below_array_by_type
PASS: hwloc_bitmap_first_last_weight
PASS: hwloc_bitmap_singlify
PASS: hwloc_type_depth
/bin/sh: line 1: 11860 Segmentation fault ${dir}$tst
FAIL: hwloc_bind
PASS: hwloc_get_last_cpu_location
PASS: hwloc_object_userdata
PASS: hwloc_synthetic
exporting topology topology to XML buffer and file for later...
init...
switching to xml...
switching to xmlbuffer...
switching to synthetic...
switching sysfs fsroot...
switching to xml and loading...
switching to xmlbuffer and loading...
switching to synthetic and loading...
switching sysfs fsroot and loading...
switching to synthetic...
PASS: hwloc_backends
/bin/sh: line 1: 11972 Segmentation fault ${dir}$tst
FAIL: hwloc_is_thissystem
No distance at depth 0
No distance at depth 1
distance matrix for depth 2:
          0 1 2 3
    0 1.000 4.000 8.000 8.000
    1 4.000 1.000 8.000 8.000
    2 8.000 8.000 1.000 4.000
    3 8.000 8.000 4.000 1.000
No distance at depth 3
No distance at depth 4
distance matrix for depth 5:
          0 1 2 3 4 5 6 7 8 9 10 11 12 13 14 15
    0 1.000 2.000 4.000 4.000 8.000 8.000 8.000 8.000 8.000 8.000 8.000 8.000 8.000 8.000 8.000 8.000
    1 2.000 1.000 4.000 4.000 8.000 8.000 8.000 8.000 8.000 8.000 8.000 8.000 8.000 8.000 8.000 8.000
    2 4.000 4.000 1.000 2.000 8.000 8.000 8.000 8.000 8.000 8.000 8.000 8.000 8.000 8.000 8.000 8.000
    3 4.000 4.000 2.000 1.000 8.000 8.000 8.000 8.000 8.000 8.000 8.000 8.000 8.000 8.000 8.000 8.000
    4 8.000 8.000 8.000 8.000 1.000 2.000 4.000 4.000 8.000 8.000 8.000 8.000 8.000 8.000 8.000 8.000
    5 8.000 8.000 8.000 8.000 2.000 1.000 4.000 4.000 8.000 8.000 8.000 8.000 8.000 8.000 8.000 8.000
    6 8.000 8.000 8.000 8.000 4.000 4.000 1.000 2.000 8.000 8.000 8.000 8.000 8.000 8.000 8.000 8.000
    7 8.000 8.000 8.000 8.000 4.000 4.000 2.000 1.000 8.000 8.000 8.000 8.000 8.000 8.000 8.000 8.000
    8 8.000 8.000 8.000 8.000 8.000 8.000 8.000 8.000 1.000 2.000 4.000 4.000 8.000 8.000 8.000 8.000
    9 8.000 8.000 8.000 8.000 8.000 8.000 8.000 8.000 2.000 1.000 4.000 4.000 8.000 8.000 8.000 8.000
   10 8.000 8.000 8.000 8.000 8.000 8.000 8.000 8.000 4.000 4.000 1.000 2.000 8.000 8.000 8.000 8.000
   11 8.000 8.000 8.000 8.000 8.000 8.000 8.000 8.000 4.000 4.000 2.000 1.000 8.000 8.000 8.000 8.000
   12 8.000 8.000 8.000 8.000 8.000 8.000 8.000 8.000 8.000 8.000 8.000 8.000 1.000 2.000 4.000 4.000
   13 8.000 8.000 8.000 8.000 8.000 8.000 8.000 8.000 8.000 8.000 8.000 8.000 2.000 1.000 4.000 4.000
   14 8.000 8.000 8.000 8.000 8.000 8.000 8.000 8.000 8.000 8.000 8.000 8.000 4.000 4.000 1.000 2.000
   15 8.000 8.000 8.000 8.000 8.000 8.000 8.000 8.000 8.000 8.000 8.000 8.000 4.000 4.000 2.000 1.000
distance matrix for NUMA nodes
          0 1 2 3
    0 1.000 4.000 8.000 8.000
    1 4.000 1.000 8.000 8.000
    2 8.000 8.000 1.000 4.000
    3 8.000 8.000 4.000 1.000
PASS: hwloc_distances
0 31
0 7
0 31
PASS: hwloc_set_distances
PASS: hwloc_groups
lt-hwloc_insert_misc: ../../src/topology.c:2764: hwloc_topology_check: Assertion `hwloc_get_depth_type(topology, hwloc_topology_get_depth(topology)-1) == HWLOC_OBJ_PU' failed.
/bin/sh: line 1: 12062 Aborted ${dir}$tst
FAIL: hwloc_insert_misc
starting from full topology
restricting to nothing, must fail
restricting to nothing, does nothing
removing one PU
removing one core
removing one node
restricting to only some already removed node, must fail
restricting to 3 PUs
restricting to a single PU
restricting to a Misc covering only the of the PU level
PASS: hwloc_topology_restrict
PASS: hwloc_obj_infos
lt-hwloc_iodevs: ../../tests/hwloc_iodevs.c:30: main: Assertion `obj->type == HWLOC_OBJ_BRIDGE' failed.
Found 1 bridges
/bin/sh: line 1: 12130 Aborted ${dir}$tst
FAIL: hwloc_iodevs
/bin/sh: line 1: 12155 Segmentation fault ${dir}$tst
FAIL: glibc-sched
exported to buffer 0x945f530 length 155
re-exported to buffer 0x945f280 length 155
PASS: xmlbuffer
========================================================
5 of 28 tests failed
Please report to http://www.open-mpi.org/community/help/
========================================================
make[4]: *** [check-TESTS] Error 1
make[4]: Leaving directory `/home/mpiteam/hwloc/nightly-tarball-build-root/trunk/create-r3680/hwloc/hwloc-1.4a1r3680/_build/tests'
make[3]: *** [check-am] Error 2
make[3]: Leaving directory `/home/mpiteam/hwloc/nightly-tarball-build-root/trunk/create-r3680/hwloc/hwloc-1.4a1r3680/_build/tests'
make[2]: *** [check-recursive] Error 1
make[2]: Leaving directory `/home/mpiteam/hwloc/nightly-tarball-build-root/trunk/create-r3680/hwloc/hwloc-1.4a1r3680/_build/tests'
make[1]: *** [check-recursive] Error 1
make[1]: Leaving directory `/home/mpiteam/hwloc/nightly-tarball-build-root/trunk/create-r3680/hwloc/hwloc-1.4a1r3680/_build'
make: *** [distcheck] Error 1
=======================================================================

Your friendly daemon,
Cyrador