Open MPI logo

Hardware Locality Development Mailing List Archives

  |   Home   |   Support   |   FAQ   |   all Hardware Locality Development mailing list

Subject: [hwloc-devel] === CREATE FAILURE (trunk) ===
From: MPI Team (mpiteam_at_[hidden])
Date: 2011-04-05 21:02:51


ERROR: Command returned a non-zero exist status (trunk):
       make distcheck

Start time: Tue Apr 5 21:01:02 EDT 2011
End time: Tue Apr 5 21:02:51 EDT 2011

=======================================================================
[... previous lines snipped ...]
config.status: creating hwloc.pc
config.status: creating tests/Makefile
config.status: creating tests/linux/Makefile
config.status: creating tests/linux/gather/Makefile
config.status: creating tests/xml/Makefile
config.status: creating tests/ports/Makefile
config.status: creating tests/linux/hwloc-gather-topology
config.status: creating tests/linux/gather/test-gather-topology.sh
config.status: creating tests/linux/test-topology.sh
config.status: creating tests/xml/test-topology.sh
config.status: creating utils/test-hwloc-distrib.sh
config.status: creating include/private/autogen/config.h
config.status: creating include/hwloc/autogen/config.h
config.status: linking ../src/topology.c to tests/ports/topology.c
config.status: linking ../src/traversal.c to tests/ports/traversal.c
config.status: linking ../src/topology-synthetic.c to tests/ports/topology-synthetic.c
config.status: linking ../src/topology-solaris.c to tests/ports/topology-solaris.c
config.status: linking ../src/topology-aix.c to tests/ports/topology-aix.c
config.status: linking ../src/topology-osf.c to tests/ports/topology-osf.c
config.status: linking ../src/topology-windows.c to tests/ports/topology-windows.c
config.status: linking ../src/topology-darwin.c to tests/ports/topology-darwin.c
config.status: linking ../src/topology-freebsd.c to tests/ports/topology-freebsd.c
config.status: linking ../src/topology-hpux.c to tests/ports/topology-hpux.c
config.status: executing depfiles commands
config.status: executing chmoding-scripts commands
config.status: executing libtool commands
make[1]: Entering directory `/home/mpiteam/hwloc/nightly-tarball-build-root/trunk/create-r3388/hwloc/hwloc-1.3a1r3388/_build'
Making all in src
make[2]: Entering directory `/home/mpiteam/hwloc/nightly-tarball-build-root/trunk/create-r3388/hwloc/hwloc-1.3a1r3388/_build/src'
  CC topology.lo
  CC traversal.lo
  CC distances.lo
  CC topology-synthetic.lo
  CC bind.lo
  CC cpuset.lo
  CC misc.lo
  CC topology-xml.lo
  CC topology-libpci.lo
../../src/topology-libpci.c: In function `hwloc_look_libpci':
../../src/topology-libpci.c:599: error: `PCI_LOOKUP_NO_NUMBERS' undeclared (first use in this function)
../../src/topology-libpci.c:599: error: (Each undeclared identifier is reported only once
../../src/topology-libpci.c:599: error: for each function it appears in.)
../../src/topology-libpci.c:605: error: too few arguments to function `pci_lookup_name'
../../src/topology-libpci.c:617: error: too few arguments to function `pci_lookup_name'
../../src/topology-libpci.c:629: error: too few arguments to function `pci_lookup_name'
make[2]: *** [topology-libpci.lo] Error 1
make[2]: Leaving directory `/home/mpiteam/hwloc/nightly-tarball-build-root/trunk/create-r3388/hwloc/hwloc-1.3a1r3388/_build/src'
make[1]: *** [all-recursive] Error 1
make[1]: Leaving directory `/home/mpiteam/hwloc/nightly-tarball-build-root/trunk/create-r3388/hwloc/hwloc-1.3a1r3388/_build'
make: *** [distcheck] Error 1
=======================================================================

Your friendly daemon,
Cyrador