Open MPI logo

Hardware Locality Development Mailing List Archives

  |   Home   |   Support   |   FAQ   |   all Hardware Locality Development mailing list

Subject: [hwloc-devel] === CREATE FAILURE (trunk) ===
From: MPI Team (mpiteam_at_[hidden])
Date: 2011-02-18 21:02:56


ERROR: Command returned a non-zero exist status (trunk):
       make distcheck

Start time: Fri Feb 18 21:01:05 EST 2011
End time: Fri Feb 18 21:02:56 EST 2011

=======================================================================
[... previous lines snipped ...]
make[2]: Nothing to be done for `dvi'.
make[2]: Leaving directory `/home/mpiteam/hwloc/nightly-tarball-build-root/trunk/create-r3188/hwloc/hwloc-1.2a1r3188/_build/doc'
make[2]: Entering directory `/home/mpiteam/hwloc/nightly-tarball-build-root/trunk/create-r3188/hwloc/hwloc-1.2a1r3188/_build'
make[2]: Nothing to be done for `dvi-am'.
make[2]: Leaving directory `/home/mpiteam/hwloc/nightly-tarball-build-root/trunk/create-r3188/hwloc/hwloc-1.2a1r3188/_build'
make[1]: Leaving directory `/home/mpiteam/hwloc/nightly-tarball-build-root/trunk/create-r3188/hwloc/hwloc-1.2a1r3188/_build'
make[1]: Entering directory `/home/mpiteam/hwloc/nightly-tarball-build-root/trunk/create-r3188/hwloc/hwloc-1.2a1r3188/_build'
Making check in src
make[2]: Entering directory `/home/mpiteam/hwloc/nightly-tarball-build-root/trunk/create-r3188/hwloc/hwloc-1.2a1r3188/_build/src'
make[2]: Nothing to be done for `check'.
make[2]: Leaving directory `/home/mpiteam/hwloc/nightly-tarball-build-root/trunk/create-r3188/hwloc/hwloc-1.2a1r3188/_build/src'
Making check in include
make[2]: Entering directory `/home/mpiteam/hwloc/nightly-tarball-build-root/trunk/create-r3188/hwloc/hwloc-1.2a1r3188/_build/include'
make[2]: Nothing to be done for `check'.
make[2]: Leaving directory `/home/mpiteam/hwloc/nightly-tarball-build-root/trunk/create-r3188/hwloc/hwloc-1.2a1r3188/_build/include'
Making check in utils
make[2]: Entering directory `/home/mpiteam/hwloc/nightly-tarball-build-root/trunk/create-r3188/hwloc/hwloc-1.2a1r3188/_build/utils'
make check-TESTS
make[3]: Entering directory `/home/mpiteam/hwloc/nightly-tarball-build-root/trunk/create-r3188/hwloc/hwloc-1.2a1r3188/_build/utils'
PASS: test-hwloc-distrib.sh
=============
1 test passed
=============
make[3]: Leaving directory `/home/mpiteam/hwloc/nightly-tarball-build-root/trunk/create-r3188/hwloc/hwloc-1.2a1r3188/_build/utils'
make[2]: Leaving directory `/home/mpiteam/hwloc/nightly-tarball-build-root/trunk/create-r3188/hwloc/hwloc-1.2a1r3188/_build/utils'
Making check in tests
make[2]: Entering directory `/home/mpiteam/hwloc/nightly-tarball-build-root/trunk/create-r3188/hwloc/hwloc-1.2a1r3188/_build/tests'
Making check in ports
make[3]: Entering directory `/home/mpiteam/hwloc/nightly-tarball-build-root/trunk/create-r3188/hwloc/hwloc-1.2a1r3188/_build/tests/ports'
make libhwloc-ports.la
make[4]: Entering directory `/home/mpiteam/hwloc/nightly-tarball-build-root/trunk/create-r3188/hwloc/hwloc-1.2a1r3188/_build/tests/ports'
  CC libhwloc_ports_la-topology.lo
  CC libhwloc_ports_la-traversal.lo
  CC libhwloc_ports_la-topology-synthetic.lo
  CC libhwloc_ports_la-topology-solaris.lo
  CC libhwloc_ports_la-topology-aix.lo
topology-aix.c:30:27: sys/systemcfg.h: No such file or directory
topology-aix.c: In function `look_rset':
topology-aix.c:457: error: `_system_configuration' undeclared (first use in this function)
topology-aix.c:457: error: (Each undeclared identifier is reported only once
topology-aix.c:457: error: for each function it appears in.)
make[4]: *** [libhwloc_ports_la-topology-aix.lo] Error 1
make[4]: Leaving directory `/home/mpiteam/hwloc/nightly-tarball-build-root/trunk/create-r3188/hwloc/hwloc-1.2a1r3188/_build/tests/ports'
make[3]: *** [check-am] Error 2
make[3]: Leaving directory `/home/mpiteam/hwloc/nightly-tarball-build-root/trunk/create-r3188/hwloc/hwloc-1.2a1r3188/_build/tests/ports'
make[2]: *** [check-recursive] Error 1
make[2]: Leaving directory `/home/mpiteam/hwloc/nightly-tarball-build-root/trunk/create-r3188/hwloc/hwloc-1.2a1r3188/_build/tests'
make[1]: *** [check-recursive] Error 1
make[1]: Leaving directory `/home/mpiteam/hwloc/nightly-tarball-build-root/trunk/create-r3188/hwloc/hwloc-1.2a1r3188/_build'
make: *** [distcheck] Error 1
=======================================================================

Your friendly daemon,
Cyrador