Open MPI logo

Hardware Locality Development Mailing List Archives

  |   Home   |   Support   |   FAQ   |   all Hardware Locality Development mailing list

Subject: [hwloc-devel] === CREATE FAILURE (trunk) ===
From: MPI Team (mpiteam_at_[hidden])
Date: 2010-09-19 21:02:43


ERROR: Command returned a non-zero exist status (trunk):
       make distcheck

Start time: Sun Sep 19 21:01:11 EDT 2010
End time: Sun Sep 19 21:02:43 EDT 2010

=======================================================================
[... previous lines snipped ...]
  CC lstopo-lstopo-color.o
  CC lstopo-lstopo-text.o
  CC lstopo-lstopo-draw.o
  CC lstopo-lstopo-fig.o
  CC lstopo-lstopo-xml.o
  CCLD lstopo
  CC hwloc-calc.o
  CCLD hwloc-calc
  CC hwloc-bind.o
  CCLD hwloc-bind
  CC hwloc-distrib.o
  CCLD hwloc-distrib
  CC hwloc-ps.o
  CCLD hwloc-ps
Creating hwloc.7 man page...
Creating lstopo.1 man page...
Creating hwloc-bind.1 man page...
Creating hwloc-distrib.1 man page...
Creating hwloc-calc.1 man page...
Creating hwloc-ps.1 man page...
make[2]: Leaving directory `/home/mpiteam/hwloc/nightly-tarball-build-root/trunk/create-r2484/hwloc/hwloc-1.1a1r2484/_build/utils'
Making all in tests
make[2]: Entering directory `/home/mpiteam/hwloc/nightly-tarball-build-root/trunk/create-r2484/hwloc/hwloc-1.1a1r2484/_build/tests'
Making all in linux
make[3]: Entering directory `/home/mpiteam/hwloc/nightly-tarball-build-root/trunk/create-r2484/hwloc/hwloc-1.1a1r2484/_build/tests/linux'
make[3]: Nothing to be done for `all'.
make[3]: Leaving directory `/home/mpiteam/hwloc/nightly-tarball-build-root/trunk/create-r2484/hwloc/hwloc-1.1a1r2484/_build/tests/linux'
Making all in ports
make[3]: Entering directory `/home/mpiteam/hwloc/nightly-tarball-build-root/trunk/create-r2484/hwloc/hwloc-1.1a1r2484/_build/tests/ports'
make[3]: Nothing to be done for `all'.
make[3]: Leaving directory `/home/mpiteam/hwloc/nightly-tarball-build-root/trunk/create-r2484/hwloc/hwloc-1.1a1r2484/_build/tests/ports'
Making all in xml
make[3]: Entering directory `/home/mpiteam/hwloc/nightly-tarball-build-root/trunk/create-r2484/hwloc/hwloc-1.1a1r2484/_build/tests/xml'
make[3]: Nothing to be done for `all'.
make[3]: Leaving directory `/home/mpiteam/hwloc/nightly-tarball-build-root/trunk/create-r2484/hwloc/hwloc-1.1a1r2484/_build/tests/xml'
make[3]: Entering directory `/home/mpiteam/hwloc/nightly-tarball-build-root/trunk/create-r2484/hwloc/hwloc-1.1a1r2484/_build/tests'
make[3]: Nothing to be done for `all-am'.
make[3]: Leaving directory `/home/mpiteam/hwloc/nightly-tarball-build-root/trunk/create-r2484/hwloc/hwloc-1.1a1r2484/_build/tests'
make[2]: Leaving directory `/home/mpiteam/hwloc/nightly-tarball-build-root/trunk/create-r2484/hwloc/hwloc-1.1a1r2484/_build/tests'
Making all in doc
make[2]: Entering directory `/home/mpiteam/hwloc/nightly-tarball-build-root/trunk/create-r2484/hwloc/hwloc-1.1a1r2484/_build/doc'
make all-am
make[3]: Entering directory `/home/mpiteam/hwloc/nightly-tarball-build-root/trunk/create-r2484/hwloc/hwloc-1.1a1r2484/_build/doc'
make[3]: *** No rule to make target `/home/mpiteam/hwloc/nightly-tarball-build-root/trunk/create-r2484/hwloc/hwloc-1.1a1r2484/include/hwloc/cuda.h', needed by `doxygen-doc/hwloc.tag'. Stop.
make[3]: Leaving directory `/home/mpiteam/hwloc/nightly-tarball-build-root/trunk/create-r2484/hwloc/hwloc-1.1a1r2484/_build/doc'
make[2]: *** [all] Error 2
make[2]: Leaving directory `/home/mpiteam/hwloc/nightly-tarball-build-root/trunk/create-r2484/hwloc/hwloc-1.1a1r2484/_build/doc'
make[1]: *** [all-recursive] Error 1
make[1]: Leaving directory `/home/mpiteam/hwloc/nightly-tarball-build-root/trunk/create-r2484/hwloc/hwloc-1.1a1r2484/_build'
make: *** [distcheck] Error 1
=======================================================================

Your friendly daemon,
Cyrador