Open MPI logo

Hardware Locality Development Mailing List Archives

  |   Home   |   Support   |   FAQ   |   all Hardware Locality Development mailing list

Subject: [hwloc-devel] === CREATE FAILURE (trunk) ===
From: MPI Team (mpiteam_at_[hidden])
Date: 2010-07-15 21:02:49


ERROR: Command returned a non-zero exist status (trunk):
       make distcheck

Start time: Thu Jul 15 21:01:02 EDT 2010
End time: Thu Jul 15 21:02:49 EDT 2010

=======================================================================
[... previous lines snipped ...]
truncating system cpuset to 23 chars (two 32bit subsets with ending comma)
got 0x0000ffff,0xffffffff,
truncating system cpuset to 51 chars (truncate to four and a half 32bit subsets)
got 0x0000ffff,0xffffffff,0xffffffff,0xffffffff,0xffff
first cpu cpuset is 0x00000001
first cpu cpuset converted back and forth, ok
last cpu cpuset is 0x00008000,,,,,,,,,,,,,,,,,,,,,,0x0
last cpu cpuset converted back and forth, ok
PASS: hwloc_cpuset_string
looked for 120 closest entries, found 119
ancestor type 1 depth 0 number 0 is system level
PASS: hwloc_get_closest_objs
found covering object type Socket covering cpuset 0x0,0x0fff,0xf0000000
covering object of 0x0,0x0fff,0xf0000000 is 0x0000ffff,0xff000000, expected 0x0000ffff,0xff000000
found system as covering object of first+last cpus cpuset 0x8000,,,,,,,,,,,,,,,,,,,,,,0x1
found no covering object for too-large cpuset 0x10000,,,,,,,,,,,,,,,,,,,,,,0x0
PASS: hwloc_get_obj_covering_cpuset
PASS: hwloc_get_cache_covering_cpuset
PASS: hwloc_get_largest_objs_inside_cpuset
PASS: hwloc_get_next_obj_covering_cpuset
PASS: hwloc_get_obj_inside_cpuset
PASS: hwloc_get_shared_cache_covering_obj
PASS: hwloc_get_obj_below_array_by_type
PASS: hwloc_cpuset_first_last_weight
PASS: hwloc_cpuset_singlify
PASS: hwloc_type_depth
/bin/sh: line 1: 1024 Segmentation fault ${dir}$tst
FAIL: hwloc_bind
/bin/sh: line 1: 1048 Segmentation fault ${dir}$tst
FAIL: hwloc_object_userdata
PASS: hwloc_synthetic
/bin/sh: line 1: 1094 Segmentation fault ${dir}$tst
FAIL: hwloc_is_thissystem
/bin/sh: line 1: 1118 Segmentation fault ${dir}$tst
FAIL: hwloc_insert_misc
/bin/sh: line 1: 1142 Segmentation fault ${dir}$tst
FAIL: glibc-sched
========================================================
5 of 18 tests failed
Please report to http://www.open-mpi.org/community/help/
========================================================
make[4]: *** [check-TESTS] Error 1
make[4]: Leaving directory `/home/mpiteam/hwloc/nightly-tarball-build-root/trunk/create-r2328/hwloc/hwloc-1.1a1r2328/_build/tests'
make[3]: *** [check-am] Error 2
make[3]: Leaving directory `/home/mpiteam/hwloc/nightly-tarball-build-root/trunk/create-r2328/hwloc/hwloc-1.1a1r2328/_build/tests'
make[2]: *** [check-recursive] Error 1
make[2]: Leaving directory `/home/mpiteam/hwloc/nightly-tarball-build-root/trunk/create-r2328/hwloc/hwloc-1.1a1r2328/_build/tests'
make[1]: *** [check-recursive] Error 1
make[1]: Leaving directory `/home/mpiteam/hwloc/nightly-tarball-build-root/trunk/create-r2328/hwloc/hwloc-1.1a1r2328/_build'
make: *** [distcheck] Error 1
=======================================================================

Your friendly daemon,
Cyrador