Open MPI logo

Hardware Locality Development Mailing List Archives

  |   Home   |   Support   |   FAQ   |   all Hardware Locality Development mailing list

Subject: [hwloc-devel] === CREATE FAILURE (trunk) ===
From: MPI Team (mpiteam_at_[hidden])
Date: 2010-04-04 21:02:46


ERROR: Command returned a non-zero exist status (trunk):
       make distcheck

Start time: Sun Apr 4 21:01:04 EDT 2010
End time: Sun Apr 4 21:02:46 EDT 2010

=======================================================================
[... previous lines snipped ...]
Get this singlethreaded process : OK
Bind this thread : OK
Get this thread : OK
Bind this whole process : OK
Get this whole process : OK
Bind whole process : OK
Get whole process : OK
Bind process : OK
Get process : OK
Bind thread : FAILED (38, Function not implemented) (expected)
Get thread : FAILED (38, Function not implemented) (expected)

now strict
Bind this singlethreaded process : OK
Get this singlethreaded process : OK
Bind this thread : OK
Get this thread : OK
Bind this whole process : OK
Get this whole process : OK
Bind whole process : OK
Get whole process : OK
Bind process : OK
Get process : OK
Bind thread : FAILED (38, Function not implemented) (expected)
Get thread : FAILED (38, Function not implemented) (expected)

PASS: hwloc_bind
PASS: hwloc_object_userdata
PASS: hwloc_synthetic
Binding with OS backend : OK
Binding with synthetic backend: OK
Binding with synthetic backend faking is_thissystem: OK
PASS: hwloc_is_thissystem
lt-hwloc_insert_misc: ../../src/topology.c:2186: hwloc_topology_check: Assertion `obj->arity == 0' failed.
/bin/sh: line 1: 15701 Aborted ${dir}$tst
FAIL: hwloc_insert_misc
PASS: glibc-sched
========================================================
2 of 18 tests failed
Please report to http://www.open-mpi.org/community/help/
========================================================
make[4]: *** [check-TESTS] Error 1
make[4]: Leaving directory `/home/mpiteam/hwloc/nightly-tarball-build-root/trunk/create-r1920/hwloc/hwloc-1.0a1r1920/_build/tests'
make[3]: *** [check-am] Error 2
make[3]: Leaving directory `/home/mpiteam/hwloc/nightly-tarball-build-root/trunk/create-r1920/hwloc/hwloc-1.0a1r1920/_build/tests'
make[2]: *** [check-recursive] Error 1
make[2]: Leaving directory `/home/mpiteam/hwloc/nightly-tarball-build-root/trunk/create-r1920/hwloc/hwloc-1.0a1r1920/_build/tests'
make[1]: *** [check-recursive] Error 1
make[1]: Leaving directory `/home/mpiteam/hwloc/nightly-tarball-build-root/trunk/create-r1920/hwloc/hwloc-1.0a1r1920/_build'
make: *** [distcheck] Error 1
=======================================================================

Your friendly daemon,
Cyrador