Open MPI logo

Hardware Locality Development Mailing List Archives

  |   Home   |   Support   |   FAQ   |   all Hardware Locality Development mailing list

Subject: [hwloc-devel] === CREATE FAILURE (trunk) ===
From: MPI Team (mpiteam_at_[hidden])
Date: 2010-02-18 21:02:52


ERROR: Command returned a non-zero exist status (trunk):
       make distcheck

Start time: Thu Feb 18 21:01:04 EST 2010
End time: Thu Feb 18 21:02:52 EST 2010

=======================================================================
[... previous lines snipped ...]
make[2]: Entering directory `/home/mpiteam/hwloc/nightly-tarball-build-root/trunk/create-r1739/hwloc/hwloc-1.0a1r1739/_build/tests'
Making check in linux
make[3]: Entering directory `/home/mpiteam/hwloc/nightly-tarball-build-root/trunk/create-r1739/hwloc/hwloc-1.0a1r1739/_build/tests/linux'
make check-TESTS
make[4]: Entering directory `/home/mpiteam/hwloc/nightly-tarball-build-root/trunk/create-r1739/hwloc/hwloc-1.0a1r1739/_build/tests/linux'
==================
All 0 tests passed
==================
make[4]: Leaving directory `/home/mpiteam/hwloc/nightly-tarball-build-root/trunk/create-r1739/hwloc/hwloc-1.0a1r1739/_build/tests/linux'
make[3]: Leaving directory `/home/mpiteam/hwloc/nightly-tarball-build-root/trunk/create-r1739/hwloc/hwloc-1.0a1r1739/_build/tests/linux'
Making check in ports
make[3]: Entering directory `/home/mpiteam/hwloc/nightly-tarball-build-root/trunk/create-r1739/hwloc/hwloc-1.0a1r1739/_build/tests/ports'
make libhwloc-ports.la
make[4]: Entering directory `/home/mpiteam/hwloc/nightly-tarball-build-root/trunk/create-r1739/hwloc/hwloc-1.0a1r1739/_build/tests/ports'
  CC libhwloc_ports_la-topology.lo
  CC libhwloc_ports_la-traversal.lo
  CC libhwloc_ports_la-topology-synthetic.lo
  CC libhwloc_ports_la-topology-solaris.lo
  CC libhwloc_ports_la-topology-aix.lo
  CC libhwloc_ports_la-topology-osf.lo
  CC libhwloc_ports_la-topology-windows.lo
  CC libhwloc_ports_la-topology-darwin.lo
  CC libhwloc_ports_la-topology-freebsd.lo
  CC libhwloc_ports_la-topology-hpux.lo
  CCLD libhwloc-ports.la
make[4]: Leaving directory `/home/mpiteam/hwloc/nightly-tarball-build-root/trunk/create-r1739/hwloc/hwloc-1.0a1r1739/_build/tests/ports'
make[3]: Leaving directory `/home/mpiteam/hwloc/nightly-tarball-build-root/trunk/create-r1739/hwloc/hwloc-1.0a1r1739/_build/tests/ports'
Making check in xml
make[3]: Entering directory `/home/mpiteam/hwloc/nightly-tarball-build-root/trunk/create-r1739/hwloc/hwloc-1.0a1r1739/_build/tests/xml'
make check-TESTS
make[4]: Entering directory `/home/mpiteam/hwloc/nightly-tarball-build-root/trunk/create-r1739/hwloc/hwloc-1.0a1r1739/_build/tests/xml'
./test-topology.sh: line 36: 1234 Segmentation fault $lstopo --xml "$srcdir"/"$1" "$file"
FAIL: 16amd64-8nd2c-cpusets.xml
PASS: 16em64t-4s2c2t.xml
PASS: 16em64t-4s2c2t-offlines.xml
./test-topology.sh: line 36: 1312 Segmentation fault $lstopo --xml "$srcdir"/"$1" "$file"
FAIL: 8em64t-2mi2ma2c.xml
========================================================
2 of 4 tests failed
Please report to http://www.open-mpi.org/community/help/
========================================================
make[4]: *** [check-TESTS] Error 1
make[4]: Leaving directory `/home/mpiteam/hwloc/nightly-tarball-build-root/trunk/create-r1739/hwloc/hwloc-1.0a1r1739/_build/tests/xml'
make[3]: *** [check-am] Error 2
make[3]: Leaving directory `/home/mpiteam/hwloc/nightly-tarball-build-root/trunk/create-r1739/hwloc/hwloc-1.0a1r1739/_build/tests/xml'
make[2]: *** [check-recursive] Error 1
make[2]: Leaving directory `/home/mpiteam/hwloc/nightly-tarball-build-root/trunk/create-r1739/hwloc/hwloc-1.0a1r1739/_build/tests'
make[1]: *** [check-recursive] Error 1
make[1]: Leaving directory `/home/mpiteam/hwloc/nightly-tarball-build-root/trunk/create-r1739/hwloc/hwloc-1.0a1r1739/_build'
make: *** [distcheck] Error 1
=======================================================================

Your friendly daemon,
Cyrador