Open MPI logo

Hardware Locality Development Mailing List Archives

  |   Home   |   Support   |   FAQ   |  

This web mail archive is frozen.

This page is part of a frozen web archive of this mailing list.

You can still navigate around this archive, but know that no new mails have been added to it since July of 2016.

Click here to be taken to the new web archives of this list; it includes all the mails that are in this frozen archive plus all new mails that have been sent to the list since it was migrated to the new archives.

Subject: [hwloc-devel] === CREATE FAILURE (trunk) ===
From: MPI Team (mpiteam_at_[hidden])
Date: 2009-12-17 21:02:43


ERROR: Command returned a non-zero exist status (trunk):
       make distcheck

Start time: Thu Dec 17 21:01:02 EST 2009
End time: Thu Dec 17 21:02:43 EST 2009

=======================================================================
[... previous lines snipped ...]
make[2]: Entering directory `/home/mpiteam/openmpi/nightly-hwloc-tarball-build-root/trunk/create-r1507/hwloc/hwloc-1.0a1r1507/_build/utils'
make check-TESTS
make[3]: Entering directory `/home/mpiteam/openmpi/nightly-hwloc-tarball-build-root/trunk/create-r1507/hwloc/hwloc-1.0a1r1507/_build/utils'
PASS: test-hwloc-distrib.sh
=============
1 test passed
=============
make[3]: Leaving directory `/home/mpiteam/openmpi/nightly-hwloc-tarball-build-root/trunk/create-r1507/hwloc/hwloc-1.0a1r1507/_build/utils'
make[2]: Leaving directory `/home/mpiteam/openmpi/nightly-hwloc-tarball-build-root/trunk/create-r1507/hwloc/hwloc-1.0a1r1507/_build/utils'
Making check in tests
make[2]: Entering directory `/home/mpiteam/openmpi/nightly-hwloc-tarball-build-root/trunk/create-r1507/hwloc/hwloc-1.0a1r1507/_build/tests'
Making check in linux
make[3]: Entering directory `/home/mpiteam/openmpi/nightly-hwloc-tarball-build-root/trunk/create-r1507/hwloc/hwloc-1.0a1r1507/_build/tests/linux'
make check-TESTS
make[4]: Entering directory `/home/mpiteam/openmpi/nightly-hwloc-tarball-build-root/trunk/create-r1507/hwloc/hwloc-1.0a1r1507/_build/tests/linux'
==================
All 0 tests passed
==================
make[4]: Leaving directory `/home/mpiteam/openmpi/nightly-hwloc-tarball-build-root/trunk/create-r1507/hwloc/hwloc-1.0a1r1507/_build/tests/linux'
make[3]: Leaving directory `/home/mpiteam/openmpi/nightly-hwloc-tarball-build-root/trunk/create-r1507/hwloc/hwloc-1.0a1r1507/_build/tests/linux'
Making check in ports
make[3]: Entering directory `/home/mpiteam/openmpi/nightly-hwloc-tarball-build-root/trunk/create-r1507/hwloc/hwloc-1.0a1r1507/_build/tests/ports'
make libhwloc-ports.la
make[4]: Entering directory `/home/mpiteam/openmpi/nightly-hwloc-tarball-build-root/trunk/create-r1507/hwloc/hwloc-1.0a1r1507/_build/tests/ports'
  CC libhwloc_ports_la-topology.lo
  CC libhwloc_ports_la-traversal.lo
  CC libhwloc_ports_la-topology-synthetic.lo
  CC libhwloc_ports_la-topology-solaris.lo
  CC libhwloc_ports_la-topology-aix.lo
  CC libhwloc_ports_la-topology-osf.lo
  CC libhwloc_ports_la-topology-windows.lo
  CC libhwloc_ports_la-topology-darwin.lo
  CC libhwloc_ports_la-topology-freebsd.lo
../../../src/topology-freebsd.c: In function `hwloc_freebsd_set_thread_cpubind':
../../../src/topology-freebsd.c:118: error: `pthread_setaffinity_np' undeclared (first use in this function)
../../../src/topology-freebsd.c:118: error: (Each undeclared identifier is reported only once
../../../src/topology-freebsd.c:118: error: for each function it appears in.)
../../../src/topology-freebsd.c:125: warning: implicit declaration of function `pthread_setaffinity_np'
../../../src/topology-freebsd.c: In function `hwloc_freebsd_get_thread_cpubind':
../../../src/topology-freebsd.c:144: error: `pthread_getaffinity_np' undeclared (first use in this function)
../../../src/topology-freebsd.c:149: warning: implicit declaration of function `pthread_getaffinity_np'
make[4]: *** [libhwloc_ports_la-topology-freebsd.lo] Error 1
make[4]: Leaving directory `/home/mpiteam/openmpi/nightly-hwloc-tarball-build-root/trunk/create-r1507/hwloc/hwloc-1.0a1r1507/_build/tests/ports'
make[3]: *** [check-am] Error 2
make[3]: Leaving directory `/home/mpiteam/openmpi/nightly-hwloc-tarball-build-root/trunk/create-r1507/hwloc/hwloc-1.0a1r1507/_build/tests/ports'
make[2]: *** [check-recursive] Error 1
make[2]: Leaving directory `/home/mpiteam/openmpi/nightly-hwloc-tarball-build-root/trunk/create-r1507/hwloc/hwloc-1.0a1r1507/_build/tests'
make[1]: *** [check-recursive] Error 1
make[1]: Leaving directory `/home/mpiteam/openmpi/nightly-hwloc-tarball-build-root/trunk/create-r1507/hwloc/hwloc-1.0a1r1507/_build'
make: *** [distcheck] Error 1
=======================================================================

Your friendly daemon,
Cyrador