Open MPI logo

Open MPI Development Mailing List Archives

  |   Home   |   Support   |   FAQ   |   all Development mailing list

Subject: Re: [OMPI devel] === CREATE FAILURE (trunk) ===
From: Ralph Castain (rhc_at_[hidden])
Date: 2014-07-28 21:16:08


Fix is coming

On Jul 28, 2014, at 6:11 PM, MPI Team <mpiteam_at_[hidden]> wrote:

>
> ERROR: Command returned a non-zero exist status (trunk):
> make -j 8 distcheck
>
> Start time: Mon Jul 28 21:05:01 EDT 2014
> End time: Mon Jul 28 21:11:02 EDT 2014
>
> =======================================================================
> [... previous lines snipped ...]
> CC class/opal_ring_buffer.lo
> CC class/opal_rb_tree.lo
> CC class/ompi_free_list.lo
> CC memoryhooks/memory.lo
> CC runtime/opal_progress.lo
> CC runtime/opal_finalize.lo
> CC runtime/opal_init.lo
> CC runtime/opal_params.lo
> CC runtime/opal_cr.lo
> CC runtime/opal_info_support.lo
> CC runtime/opal_progress_threads.lo
> CC threads/condition.lo
> CC threads/mutex.lo
> CC threads/thread.lo
> CC threads/tsd.lo
> CC dss/dss_internal_functions.lo
> CC dss/dss_compare.lo
> CC dss/dss_copy.lo
> CC dss/dss_dump.lo
> CC dss/dss_load_unload.lo
> CC dss/dss_lookup.lo
> CC dss/dss_pack.lo
> CC dss/dss_peek.lo
> CC dss/dss_print.lo
> CC dss/dss_register.lo
> CC dss/dss_unpack.lo
> CC dss/dss_open_close.lo
> CCLD libopen-pal.la
> make[3]: Leaving directory `/home/mpiteam/openmpi/nightly-tarball-build-root/trunk/create-r32335/ompi/openmpi-1.9a1r32335/_build/opal'
> Making all in mca/common/sm
> make[3]: Entering directory `/home/mpiteam/openmpi/nightly-tarball-build-root/trunk/create-r32335/ompi/openmpi-1.9a1r32335/_build/opal/mca/common/sm'
> CC common_sm.lo
> LN_S libmca_common_sm.la
> ../../../../../opal/mca/common/sm/common_sm.c:54:27: error: common_sm_rml.h: No such file or directory
> ../../../../../opal/mca/common/sm/common_sm.c: In function 'attach_and_init':
> ../../../../../opal/mca/common/sm/common_sm.c:83: warning: implicit declaration of function 'opal_shmem_segment_attach'
> ../../../../../opal/mca/common/sm/common_sm.c:83: warning: cast to pointer from integer of different size
> ../../../../../opal/mca/common/sm/common_sm.c:90: warning: implicit declaration of function 'opal_shmem_segment_detach'
> ../../../../../opal/mca/common/sm/common_sm.c:96: warning: implicit declaration of function 'opal_shmem_ds_copy'
> ../../../../../opal/mca/common/sm/common_sm.c: In function 'mca_common_sm_module_create_and_attach':
> ../../../../../opal/mca/common/sm/common_sm.c:172: warning: implicit declaration of function 'opal_shmem_segment_create'
> ../../../../../opal/mca/common/sm/common_sm.c: In function 'mca_common_sm_module_unlink':
> ../../../../../opal/mca/common/sm/common_sm.c:208: warning: implicit declaration of function 'opal_shmem_unlink'
> make[3]: *** [common_sm.lo] Error 1
> make[3]: Leaving directory `/home/mpiteam/openmpi/nightly-tarball-build-root/trunk/create-r32335/ompi/openmpi-1.9a1r32335/_build/opal/mca/common/sm'
> make[2]: *** [all-recursive] Error 1
> make[2]: Leaving directory `/home/mpiteam/openmpi/nightly-tarball-build-root/trunk/create-r32335/ompi/openmpi-1.9a1r32335/_build/opal'
> make[1]: *** [all-recursive] Error 1
> make[1]: Leaving directory `/home/mpiteam/openmpi/nightly-tarball-build-root/trunk/create-r32335/ompi/openmpi-1.9a1r32335/_build'
> make: *** [distcheck] Error 1
> =======================================================================
>
> Your friendly daemon,
> Cyrador
> _______________________________________________
> testing mailing list
> testing_at_[hidden]
> http://www.open-mpi.org/mailman/listinfo.cgi/testing