Open MPI logo

Open MPI Development Mailing List Archives

  |   Home   |   Support   |   FAQ   |   all Development mailing list

Subject: [OMPI devel] v1.8 - compile/dist problem
From: Mike Dubman (miked_at_[hidden])
Date: 2014-07-23 09:01:05


  CC libvt_mpi_la-vt_iowrap_helper.lo
  CC libvt_mpi_la-vt_libwrap.lo
  CC libvt_mpi_la-vt_mallocwrap.lo
  CC libvt_mpi_la-vt_mpifile.lo
make[6]: Entering directory
'/var/tmp/OFED_topdir/BUILD/openmpi-1.8.2rc2/ompi/contrib/vt/vt/tools/vtunify/mpi'
ln -s
/var/tmp/OFED_topdir/BUILD/openmpi-1.8.2rc2/ompi/contrib/vt/vt/tools/vtunify/vt_unify.cc
vt_unify.cc
ln -s
/var/tmp/OFED_topdir/BUILD/openmpi-1.8.2rc2/ompi/contrib/vt/vt/tools/vtunify/vt_unify_defs.cc
vt_unify_defs.cc
ln -s
/var/tmp/OFED_topdir/BUILD/openmpi-1.8.2rc2/ompi/contrib/vt/vt/tools/vtunify/vt_unify_defs_recs.cc
vt_unify_defs_recs.cc
ln -s
/var/tmp/OFED_topdir/BUILD/openmpi-1.8.2rc2/ompi/contrib/vt/vt/tools/vtunify/vt_unify_events_stats.cc
vt_unify_events_stats.cc
ln -s
/var/tmp/OFED_topdir/BUILD/openmpi-1.8.2rc2/ompi/contrib/vt/vt/tools/vtunify/vt_unify_handlers.cc
vt_unify_handlers.cc
ln -s
/var/tmp/OFED_topdir/BUILD/openmpi-1.8.2rc2/ompi/contrib/vt/vt/tools/vtunify/vt_unify_hooks.cc
vt_unify_hooks.cc
ln -s
/var/tmp/OFED_topdir/BUILD/openmpi-1.8.2rc2/ompi/contrib/vt/vt/tools/vtunify/vt_unify_markers.cc
vt_unify_markers.cc
ln -s
/var/tmp/OFED_topdir/BUILD/openmpi-1.8.2rc2/ompi/contrib/vt/vt/tools/vtunify/vt_unify_sync.cc
vt_unify_sync.cc
ln -s
/var/tmp/OFED_topdir/BUILD/openmpi-1.8.2rc2/ompi/contrib/vt/vt/tools/vtunify/vt_unify_tkfac.cc
vt_unify_tkfac.cc
ln -s
/var/tmp/OFED_topdir/BUILD/openmpi-1.8.2rc2/ompi/contrib/vt/vt/tools/vtunify/vt_unify_usrcom.cc
vt_unify_usrcom.cc
ln -s
/var/tmp/OFED_topdir/BUILD/openmpi-1.8.2rc2/ompi/contrib/vt/vt/tools/vtunify/hooks/vt_unify_hooks_base.cc
hooks/vt_unify_hooks_base.cc
ln: failed to create symbolic link ‘hooks/vt_unify_hooks_base.cc’: No
such file or directory
Makefile:1593: recipe for target 'hooks/vt_unify_hooks_base.cc' failed
make[6]: *** [hooks/vt_unify_hooks_base.cc] Error 1
make[6]: Leaving directory
'/var/tmp/OFED_topdir/BUILD/openmpi-1.8.2rc2/ompi/contrib/vt/vt/tools/vtunify/mpi'
Makefile:3548: recipe for target '../tools/vtunify/mpi/libvt-mpi-unify.la'
failed
make[5]: *** [../tools/vtunify/mpi/libvt-mpi-unify.la] Error 2
make[5]: *** Waiting for unfinished jobs....
make[5]: Leaving directory
'/var/tmp/OFED_topdir/BUILD/openmpi-1.8.2rc2/ompi/contrib/vt/vt/vtlib'
Makefile:810: recipe for target 'all-recursive' failed
make[4]: *** [all-recursive] Error 1
make[4]: Leaving directory
'/var/tmp/OFED_topdir/BUILD/openmpi-1.8.2rc2/ompi/contrib/vt/vt'
Makefile:679: recipe for target 'all' failed
make[3]: *** [all] Error 2
make[3]: Leaving directory
'/var/tmp/OFED_topdir/BUILD/openmpi-1.8.2rc2/ompi/contrib/vt/vt'
Makefile:1579: recipe for target 'all-recursive' failed
make[2]: *** [all-recursive] Error 1
make[2]: Leaving directory
'/var/tmp/OFED_topdir/BUILD/openmpi-1.8.2rc2/ompi/contrib/vt'
Makefile:3152: recipe for target 'all-recursive' failed
make[1]: *** [all-recursive] Error 1
make[1]: Leaving directory
'/var/tmp/OFED_topdir/BUILD/openmpi-1.8.2rc2/ompi'
Makefile:1714: recipe for target 'all-recursive' failed
make: *** [all-recursive] Error 1
error: Bad exit status from /var/tmp/rpm-tmp.QzMv2a (%build)