Open MPI logo

Open MPI Development Mailing List Archives

  |   Home   |   Support   |   FAQ   |   all Development mailing list

Subject: Re: [OMPI devel] compile error in v1.7
From: Mike Dubman (miked_at_[hidden])
Date: 2014-02-27 09:48:19


yep, now it fine.
thx

On Thu, Feb 27, 2014 at 4:43 PM, Ralph Castain <rhc_at_[hidden]> wrote:

> you need to update your repo
>
> On Feb 26, 2014, at 9:55 PM, Mike Dubman <miked_at_[hidden]> wrote:
>
> *07:32:17* make[2]: Entering directory `/scrap/jenkins/workspace/ompi-vendor-gerrit/label/hpc/orte'*07:32:17* CC runtime/orte_finalize.lo*07:32:17* CC runtime/orte_init.lo*07:32:17* CC runtime/orte_locks.lo*07:32:17* CC runtime/orte_globals.lo*07:32:18* CC runtime/orte_quit.lo*07:32:18* CC runtime/data_type_support/orte_dt_compare_fns.lo*07:32:18* CC runtime/data_type_support/orte_dt_copy_fns.lo*07:32:19* CC runtime/data_type_support/orte_dt_print_fns.lo*07:32:19* CC runtime/data_type_support/orte_dt_packing_fns.lo*07:32:20* CC runtime/data_type_support/orte_dt_unpacking_fns.lo*07:32:20* CC runtime/orte_mca_params.lo*07:32:20* CC runtime/orte_wait.lo*07:32:21* CC runtime/orte_cr.lo*07:32:21* CC runtime/orte_data_server.lo*07:32:21* CC runtime/orte_info_support.lo*07:32:21* CC util/error_strings.lo*07:32:22* CC util/name_fns.lo*07:32:22* CC util/proc_info.lo*07:32:22* CC util/session_dir.lo*07:32:23* CC util/show_help.lo*07:32:23* CC util/context_fns.lo*07:32:23* CC util/parse_options.lo*07:32:23* CC util/pre_condition_transports.lo*07:32:24* CC util/hnp_contact.lo*07:32:24* LEX util/hostfile/hostfile_lex.c*07:32:24* CC util/hostfile/hostfile_lex.lo*07:32:24* CC util/hostfile/hostfile.lo*07:32:25* CC util/dash_host/dash_host.lo*07:32:26* CC util/comm/comm.lo*07:32:26* CC util/nidmap.lo*07:32:26* util/nidmap.c: In function 'orte_util_decode_pidmap':*07:32:26* util/nidmap.c:1033: error: 'OPAL_DB_LOCALRANK' undeclared (first use in this function)*07:32:26* util/nidmap.c:1033: error: (Each undeclared identifier is reported only once*07:32:26* util/nidmap.c:1033: error: for each function it appears in.)*07:32:26* make[2]: *** [util/nidmap.lo] Error 1*07:32:26* make[2]: Leaving directory `/scrap/jenkins/workspace/ompi-vendor-gerrit/label/hpc/orte'*07:32:26* make[1]: *** [install-recursive] Error 1*07:32:26* make[1]: Leaving directory `/scrap/jenkins/workspace/ompi-vendor-gerrit/label/hpc/orte'*07:32:26* make: *** [install-recursive] Error 1
>
> _______________________________________________
> devel mailing list
> devel_at_[hidden]
> http://www.open-mpi.org/mailman/listinfo.cgi/devel
>
>
>
> _______________________________________________
> devel mailing list
> devel_at_[hidden]
> http://www.open-mpi.org/mailman/listinfo.cgi/devel
>