Open MPI logo

Open MPI Development Mailing List Archives

  |   Home   |   Support   |   FAQ   |   all Development mailing list

Subject: Re: [OMPI devel] === CREATE FAILURE (v1.7) ===
From: Jeff Squyres (jsquyres) (jsquyres_at_[hidden])
Date: 2013-07-02 11:14:51


Here's the beginning of the error:

  CC lt_interface.lo
In file included from ../../../opal/util/lt_interface.c:21:
../../../opal/libltdl/ltdl.h:36:31: libltdl/lt_system.h: No such file or directory
../../../opal/libltdl/ltdl.h:37:30: libltdl/lt_error.h: No such file or directory
../../../opal/libltdl/ltdl.h:38:33: libltdl/lt_dlloader.h: No such file or directory
In file included from ../../../opal/util/lt_interface.c:21:
../../../opal/libltdl/ltdl.h:50: error: syntax error before "typedef"
../../../opal/libltdl/ltdl.h:53: error: syntax error before "int"
../../../opal/libltdl/ltdl.h:54: error: syntax error before "int"
../../../opal/libltdl/ltdl.h:57: error: syntax error before "int"

On Jul 1, 2013, at 10:11 PM, MPI Team <mpiteam_at_[hidden]> wrote:

>
> ERROR: Command returned a non-zero exist status (v1.7):
> make distcheck
>
> Start time: Mon Jul 1 21:53:47 EDT 2013
> End time: Mon Jul 1 22:11:52 EDT 2013
>
> =======================================================================
> [... previous lines snipped ...]
> ../../../opal/libltdl/ltdl.h:79: error: syntax error before "lt_dlhandle"
> ../../../opal/libltdl/ltdl.h:80: error: syntax error before "lt_dladvise"
> ../../../opal/libltdl/ltdl.h:81: error: syntax error before "void"
> ../../../opal/libltdl/ltdl.h:82: error: syntax error before "const"
> ../../../opal/libltdl/ltdl.h:83: error: syntax error before "int"
> ../../../opal/libltdl/ltdl.h:99: error: syntax error before "int"
> ../../../opal/libltdl/ltdl.h:100: error: syntax error before "int"
> ../../../opal/libltdl/ltdl.h:101: error: syntax error before "int"
> ../../../opal/libltdl/ltdl.h:106: error: syntax error before "lt_dlsymlist"
> ../../../opal/libltdl/ltdl.h:121: error: syntax error before "lt_dlinterface_id"
> ../../../opal/libltdl/ltdl.h:123: error: syntax error before "void"
> ../../../opal/libltdl/ltdl.h:124: error: syntax error before "void"
> ../../../opal/libltdl/ltdl.h:126: error: syntax error before "void"
> ../../../opal/libltdl/ltdl.h:143: error: syntax error before "const"
> ../../../opal/libltdl/ltdl.h:145: error: syntax error before "lt_dlhandle"
> ../../../opal/libltdl/ltdl.h:147: error: syntax error before "lt_dlhandle"
> ../../../opal/libltdl/ltdl.h:149: error: syntax error before "int"
> ../../../opal/libltdl/ltdl.h:156: error: syntax error before "int"
> ../../../opal/libltdl/ltdl.h:157: error: syntax error before "int"
> ../../../opal/util/lt_interface.c:31: error: syntax error before "struct"
> ../../../opal/util/lt_interface.c:32: error: syntax error before "lt_dladvise"
> ../../../opal/util/lt_interface.c:32: warning: no semicolon at end of struct or union
> ../../../opal/util/lt_interface.c: In function `opal_lt_dladvise_init':
> ../../../opal/util/lt_interface.c:101: error: invalid application of `sizeof' to incomplete type `opal_lt_dladvise_st'
> ../../../opal/util/lt_interface.c:105: error: dereferencing pointer to incomplete type
> ../../../opal/util/lt_interface.c: In function `opal_lt_dladvise_destroy':
> ../../../opal/util/lt_interface.c:113: error: dereferencing pointer to incomplete type
> ../../../opal/util/lt_interface.c: In function `opal_lt_dladvise_ext':
> ../../../opal/util/lt_interface.c:124: error: dereferencing pointer to incomplete type
> ../../../opal/util/lt_interface.c: In function `opal_lt_dladvise_resident':
> ../../../opal/util/lt_interface.c:133: error: dereferencing pointer to incomplete type
> ../../../opal/util/lt_interface.c: In function `opal_lt_dladvise_local':
> ../../../opal/util/lt_interface.c:142: error: dereferencing pointer to incomplete type
> ../../../opal/util/lt_interface.c: In function `opal_lt_dladvise_global':
> ../../../opal/util/lt_interface.c:151: error: dereferencing pointer to incomplete type
> ../../../opal/util/lt_interface.c: In function `opal_lt_dladvise_preload':
> ../../../opal/util/lt_interface.c:160: error: dereferencing pointer to incomplete type
> ../../../opal/util/lt_interface.c: In function `opal_lt_dlopenadvise':
> ../../../opal/util/lt_interface.c:237: error: dereferencing pointer to incomplete type
> ../../../opal/util/lt_interface.c: At top level:
> ../../../opal/libltdl/ltdl.h:106: warning: array 'lt__PROGRAM__LTX_preloaded_symbols' assumed to have one element
> make[4]: *** [lt_interface.lo] Error 1
> make[4]: Leaving directory `/home/mpiteam/openmpi/nightly-tarball-build-root/v1.7/create-r28699/ompi/openmpi-1.7.3a1r28699/_build/opal/util'
> make[3]: *** [all-recursive] Error 1
> make[3]: Leaving directory `/home/mpiteam/openmpi/nightly-tarball-build-root/v1.7/create-r28699/ompi/openmpi-1.7.3a1r28699/_build/opal/util'
> make[2]: *** [all-recursive] Error 1
> make[2]: Leaving directory `/home/mpiteam/openmpi/nightly-tarball-build-root/v1.7/create-r28699/ompi/openmpi-1.7.3a1r28699/_build/opal'
> make[1]: *** [all-recursive] Error 1
> make[1]: Leaving directory `/home/mpiteam/openmpi/nightly-tarball-build-root/v1.7/create-r28699/ompi/openmpi-1.7.3a1r28699/_build'
> make: *** [distcheck] Error 1
> =======================================================================
>
> Your friendly daemon,
> Cyrador
> _______________________________________________
> testing mailing list
> testing_at_[hidden]
> http://www.open-mpi.org/mailman/listinfo.cgi/testing

-- 
Jeff Squyres
jsquyres_at_[hidden]
For corporate legal information go to: http://www.cisco.com/web/about/doing_business/legal/cri/