Open MPI logo

Open MPI Development Mailing List Archives

  |   Home   |   Support   |   FAQ   |   all Development mailing list

Subject: Re: [OMPI devel] 1.3.1rc3 was borked; 1.3.1rc4 is out
From: Pavel Shamis (Pasha) (pashash_at_[hidden])
Date: 2009-03-05 06:52:44


I tried to build latest OFED with new ompi rc4, but is looks that vtune
code is broken again ?

gcc -DHAVE_CONFIG_H -I. -I.. -I../tools/opari/lib -I../extlib/otf/otflib
-I../extlib/otf/otflib -D_GNU_SOURCE
-DBINDIR=\"/usr/local/mpi/gcc/openmpi-1.3.1rc4/bin\"
-DDATADIR=\"/usr/local/mpi/gcc/openmpi-1.3.1rc4/share\" -DRFG
-DVT_MEMHOOK -DVT_IOWRAP -O2 -g -pipe -Wall -Wp,-D_FORTIFY_SOURCE=2
-fexceptions -fstack-protector --param=ssp-buffer-size=4 -m32
-march=i386 -mtune=generic -fasynchronous-unwind-tables -MT
vt_iowrap_helper.o -MD -MP -MF .deps/vt_iowrap_helper.Tpo -c -o
vt_iowrap_helper.o vt_iowrap_helper.c
gcc -DHAVE_CONFIG_H -I. -I.. -I../tools/opari/lib -I../extlib/otf/otflib
-I../extlib/otf/otflib -D_GNU_SOURCE
-DBINDIR=\"/usr/local/mpi/gcc/openmpi-1.3.1rc4/bin\"
-DDATADIR=\"/usr/local/mpi/gcc/openmpi-1.3.1rc4/share\" -DRFG
-DVT_MEMHOOK -DVT_IOWRAP -O2 -g -pipe -Wall -Wp,-D_FORTIFY_SOURCE=2
-fexceptions -fstack-protector --param=ssp-buffer-size=4 -m32
-march=i386 -mtune=generic -fasynchronous-unwind-tables -MT
rfg_regions.o -MD -MP -MF .deps/rfg_regions.Tpo -c -o rfg_regions.o
rfg_regions.c
*vt_iowrap.c:1242: error: expected declaration specifiers or '...'
before numeric constant
vt_iowrap.c:1243: error: conflicting types for '__fprintf_chk'
*gcc -DHAVE_CONFIG_H -I. -I.. -I../tools/opari/lib
-I../extlib/otf/otflib -I../extlib/otf/otflib -D_GNU_SOURCE
-DBINDIR=\"/usr/local/mpi/gcc/openmpi-1.3.1rc4/bin\"
-DDATADIR=\"/usr/local/mpi/gcc/openmpi-1.3.1rc4/share\" -DRFG
-DVT_MEMHOOK -DVT_IOWRAP -O2 -g -pipe -Wall -Wp,-D_FORTIFY_SOURCE=2
-fexceptions -fstack-protector --param=ssp-buffer-size=4 -m32
-march=i386 -mtune=generic -fasynchronous-unwind-tables -MT rfg_filter.o
-MD -MP -MF .deps/rfg_filter.Tpo -c -o rfg_filter.o rfg_filter.c
make[5]: *** [vt_iowrap.o] Error 1
make[5]: *** Waiting for unfinished jobs....
mv -f .deps/vt_iowrap_helper.Tpo .deps/vt_iowrap_helper.Po
mv -f .deps/rfg_filter.Tpo .deps/rfg_filter.Po
mv -f .deps/rfg_regions.Tpo .deps/rfg_regions.Po
make[5]: Leaving directory
`/var/tmp/OFED_topdir/BUILD/openmpi-1.3.1rc4/ompi/contrib/vt/vt/vtlib'
make[4]: *** [all-recursive] Error 1
make[4]: Leaving directory
`/var/tmp/OFED_topdir/BUILD/openmpi-1.3.1rc4/ompi/contrib/vt/vt'
make[3]: *** [all] Error 2
make[3]: Leaving directory
`/var/tmp/OFED_topdir/BUILD/openmpi-1.3.1rc4/ompi/contrib/vt/vt'
make[2]: *** [all-recursive] Error 1
make[2]: Leaving directory
`/var/tmp/OFED_topdir/BUILD/openmpi-1.3.1rc4/ompi/contrib/vt'
make[1]: *** [all-recursive] Error 1
make[1]: Leaving directory
`/var/tmp/OFED_topdir/BUILD/openmpi-1.3.1rc4/ompi'
make: *** [all-recursive] Error 1
error: Bad exit status from /var/tmp/rpm-tmp.43206 (%build)

Ralph H. Castain wrote:
> Looks okay to me Brian - I went ahead and filed the CMR and sent it on to
> Brad for approval.
>
> Ralph
>
>
>
>> On Tue, 3 Mar 2009, Brian W. Barrett wrote:
>>
>>
>>> On Tue, 3 Mar 2009, Jeff Squyres wrote:
>>>
>>>
>>>> 1.3.1rc3 had a race condition in the ORTE shutdown sequence. The only
>>>> difference between rc3 and rc4 was a fix for that race condition.
>>>> Please
>>>> test ASAP:
>>>>
>>>> http://www.open-mpi.org/software/ompi/v1.3/
>>>>
>>> I'm sorry, I've failed to test rc1 & rc2 on Catamount. I'm getting a
>>> compile
>>> failure in the ORTE code. I'll do a bit more testing and send Ralph an
>>> e-mail this afternoon.
>>>
>> Attached is a patch against v1.3 branch that makes it work on Red Storm.
>> I'm not sure it's right, so I'm just e-mailing it rather than committing..
>> Sorry Ralph, but can you take a look? :(
>>
>> Brian_______________________________________________
>> devel mailing list
>> devel_at_[hidden]
>> http://www.open-mpi.org/mailman/listinfo.cgi/devel
>>
>
> _______________________________________________
> devel mailing list
> devel_at_[hidden]
> http://www.open-mpi.org/mailman/listinfo.cgi/devel
>
>