Open MPI logo

Open MPI Development Mailing List Archives

  |   Home   |   Support   |   FAQ   |   all Development mailing list

Subject: [OMPI devel] vt integration -- still problems on os x
From: Jeff Squyres (jsquyres_at_[hidden])
Date: 2008-01-08 13:24:11


 From today's head (r17068):

Making all in vtunify
g++ -fopenmp -DVT_OMP -g -Wall -Wundef -Wno-long-long -finline-
functions -fopenmp -Wl,-u,_munmap -Wl,-multiply_defined,suppress -o
vtunify vtunify-vt_unify.o vtunify-vt_unify_defs.o vtunify-
vt_unify_defs_hdlr.o vtunify-vt_unify_events.o vtunify-
vt_unify_events_hdlr.o vtunify-vt_unify_stats.o vtunify-
vt_unify_stats_hdlr.o vtunify-vt_unify_tkfac.o -L../../extlib/otf/
otflib -L../../extlib/otf/otflib/.libs -lotf -lz -lutil
Undefined symbols:
   "__gnu_cxx::__normal_iterator<Statistics::FuncStat_struct*,
std::vector<Statistics::FuncStat_struct,
std::allocator<Statistics::FuncStat_struct> > >
std
::find_if<__gnu_cxx::__normal_iterator<Statistics::FuncStat_struct*,
std::vector<Statistics::FuncStat_struct,
std::allocator<Statistics::FuncStat_struct> > >,
Statistics
::FuncStat_funcId_eq
>(__gnu_cxx::__normal_iterator<Statistics::FuncStat_struct*,
std::vector<Statistics::FuncStat_struct,
std::allocator<Statistics::FuncStat_struct> > >,
__gnu_cxx::__normal_iterator<Statistics::FuncStat_struct*,
std::vector<Statistics::FuncStat_struct,
std::allocator<Statistics::FuncStat_struct> > >,
Statistics::FuncStat_funcId_eq)", referenced from:
       Statistics::getFuncStat() in vtunify-vt_unify_stats.o
   "void
std::sort<__gnu_cxx::__normal_iterator<Statistics::FuncStat_struct*,
std::vector<Statistics::FuncStat_struct,
std::allocator<Statistics::FuncStat_struct> > >,
std::less<Statistics::FuncStat_struct>
>(__gnu_cxx::__normal_iterator<Statistics::FuncStat_struct*,
std::vector<Statistics::FuncStat_struct,
std::allocator<Statistics::FuncStat_struct> > >,
__gnu_cxx::__normal_iterator<Statistics::FuncStat_struct*,
std::vector<Statistics::FuncStat_struct,
std::allocator<Statistics::FuncStat_struct> > >,
std::less<Statistics::FuncStat_struct>)", referenced from:
       Statistics::printFuncStat(std::basic_string<char,
std::char_traits<char>, std::allocator<char> >,
std::vector<Statistics::FuncStat_struct,
std::allocator<Statistics::FuncStat_struct> >&, int)in vtunify-
vt_unify_stats.o
       Statistics::printFuncStat(std::basic_string<char,
std::char_traits<char>, std::allocator<char> >,
std::vector<Statistics::FuncStat_struct,
std::allocator<Statistics::FuncStat_struct> >&, int)in vtunify-
vt_unify_stats.o
ld: symbol(s) not found
collect2: ld returned 1 exit status
make[6]: *** [vtunify] Error 1
make[5]: *** [all-recursive] Error 1
make[4]: *** [all-recursive] Error 1
make[3]: *** [all] Error 2
make[2]: *** [all-recursive] Error 1
make[1]: *** [all-recursive] Error 1
make: *** [all-recursive] Error 1
jsquyres has logged on ttys005 from local.
jsquyres has logged on ttys006 from local.
[13:19] rtp-jsquyres-8712:~/svn/vt-integration %

-- 
Jeff Squyres
Cisco Systems