Open MPI logo

Open MPI Development Mailing List Archives

  |   Home   |   Support   |   FAQ   |   all Development mailing list

Subject: Re: [OMPI devel] === CREATE FAILURE ===
From: George Bosilca (bosilca_at_[hidden])
Date: 2007-12-06 21:29:28


Fixed by r16884.

   george.

On Dec 7, 2007, at 12:46 PM, MPI Team wrote:

>
> ERROR: Command returned a non-zero exist status
> make -j 4 distcheck
>
> Start time: Thu Dec 6 21:00:25 EST 2007
> End time: Thu Dec 6 21:16:34 EST 2007
>
> =
> ======================================================================
> [... previous lines snipped ...]
> /bin/sh ../libtool --tag=CC --mode=compile gcc -DHAVE_CONFIG_H -I.
> -I../opal/include -I../orte/include -I../ompi/include -I../opal/mca/
> paffinity/linux/plpa/src/libplpa -I../../ompi -I../.. -I.. -I../../
> opal/include -I../../orte/include -I../../ompi/include -O3 -
> DNDEBUG -finline-functions -fno-strict-aliasing -pthread -MT proc/
> proc.lo -MD -MP -MF $depbase.Tpo -c -o proc/proc.lo ../../ompi/proc/
> proc.c &&\
> mv -f $depbase.Tpo $depbase.Plo
> libtool: compile: gcc -DHAVE_CONFIG_H -I. -I../opal/include -I../
> orte/include -I../ompi/include -I../opal/mca/paffinity/linux/plpa/
> src/libplpa -I../../ompi -I../.. -I.. -I../../opal/include -I../../
> orte/include -I../../ompi/include -O3 -DNDEBUG -finline-functions -
> fno-strict-aliasing -pthread -MT op/op_predefined.lo -MD -MP -MF
> op/.deps/op_predefined.Tpo -c ../../ompi/op/op_predefined.c -fPIC -
> DPIC -o op/.libs/op_predefined.o
> libtool: compile: gcc -DHAVE_CONFIG_H -I. -I../opal/include -I../
> orte/include -I../ompi/include -I../opal/mca/paffinity/linux/plpa/
> src/libplpa -I../../ompi -I../.. -I.. -I../../opal/include -I../../
> orte/include -I../../ompi/include -O3 -DNDEBUG -finline-functions -
> fno-strict-aliasing -pthread -MT proc/proc.lo -MD -MP -MF proc/.deps/
> proc.Tpo -c ../../ompi/proc/proc.c -fPIC -DPIC -o proc/.libs/proc.o
> depbase=`echo request/grequest.lo | sed 's|[^/]*$|.deps/&|;s|\.lo
> $||'`;\
> /bin/sh ../libtool --tag=CC --mode=compile gcc -DHAVE_CONFIG_H -I.
> -I../opal/include -I../orte/include -I../ompi/include -I../opal/mca/
> paffinity/linux/plpa/src/libplpa -I../../ompi -I../.. -I.. -I../../
> opal/include -I../../orte/include -I../../ompi/include -O3 -
> DNDEBUG -finline-functions -fno-strict-aliasing -pthread -MT request/
> grequest.lo -MD -MP -MF $depbase.Tpo -c -o request/grequest.lo ../../
> ompi/request/grequest.c &&\
> mv -f $depbase.Tpo $depbase.Plo
> depbase=`echo request/request.lo | sed 's|[^/]*$|.deps/&|;s|\.lo
> $||'`;\
> /bin/sh ../libtool --tag=CC --mode=compile gcc -DHAVE_CONFIG_H -I.
> -I../opal/include -I../orte/include -I../ompi/include -I../opal/mca/
> paffinity/linux/plpa/src/libplpa -I../../ompi -I../.. -I.. -I../../
> opal/include -I../../orte/include -I../../ompi/include -O3 -
> DNDEBUG -finline-functions -fno-strict-aliasing -pthread -MT request/
> request.lo -MD -MP -MF $depbase.Tpo -c -o request/request.lo ../../
> ompi/request/request.c &&\
> mv -f $depbase.Tpo $depbase.Plo
> libtool: compile: gcc -DHAVE_CONFIG_H -I. -I../opal/include -I../
> orte/include -I../ompi/include -I../opal/mca/paffinity/linux/plpa/
> src/libplpa -I../../ompi -I../.. -I.. -I../../opal/include -I../../
> orte/include -I../../ompi/include -O3 -DNDEBUG -finline-functions -
> fno-strict-aliasing -pthread -MT request/grequest.lo -MD -MP -MF
> request/.deps/grequest.Tpo -c ../../ompi/request/grequest.c -fPIC -
> DPIC -o request/.libs/grequest.o
> libtool: compile: gcc -DHAVE_CONFIG_H -I. -I../opal/include -I../
> orte/include -I../ompi/include -I../opal/mca/paffinity/linux/plpa/
> src/libplpa -I../../ompi -I../.. -I.. -I../../opal/include -I../../
> orte/include -I../../ompi/include -O3 -DNDEBUG -finline-functions -
> fno-strict-aliasing -pthread -MT request/request.lo -MD -MP -MF
> request/.deps/request.Tpo -c ../../ompi/request/request.c -fPIC -
> DPIC -o request/.libs/request.o
> depbase=`echo request/req_test.lo | sed 's|[^/]*$|.deps/&|;s|\.lo
> $||'`;\
> /bin/sh ../libtool --tag=CC --mode=compile gcc -DHAVE_CONFIG_H -I.
> -I../opal/include -I../orte/include -I../ompi/include -I../opal/mca/
> paffinity/linux/plpa/src/libplpa -I../../ompi -I../.. -I.. -I../../
> opal/include -I../../orte/include -I../../ompi/include -O3 -
> DNDEBUG -finline-functions -fno-strict-aliasing -pthread -MT request/
> req_test.lo -MD -MP -MF $depbase.Tpo -c -o request/req_test.lo ../../
> ompi/request/req_test.c &&\
> mv -f $depbase.Tpo $depbase.Plo
> ../../ompi/request/request.c:24:42: ompi/request/request_default.h:
> No such file or directory
> ../../ompi/request/request.c:36: error: `ompi_request_default_test'
> undeclared here (not in a function)
> ../../ompi/request/request.c:36: error: initializer element is not
> constant
> ../../ompi/request/request.c:36: error: (near initialization for
> `ompi_request_functions.req_test')
> ../../ompi/request/request.c:37: error:
> `ompi_request_default_test_any' undeclared here (not in a function)
> ../../ompi/request/request.c:37: error: initializer element is not
> constant
> ../../ompi/request/request.c:37: error: (near initialization for
> `ompi_request_functions.req_test_any')
> ../../ompi/request/request.c:38: error:
> `ompi_request_default_test_all' undeclared here (not in a function)
> ../../ompi/request/request.c:38: error: initializer element is not
> constant
> ../../ompi/request/request.c:38: error: (near initialization for
> `ompi_request_functions.req_test_all')
> ../../ompi/request/request.c:39: error:
> `ompi_request_default_test_some' undeclared here (not in a function)
> ../../ompi/request/request.c:39: error: initializer element is not
> constant
> ../../ompi/request/request.c:39: error: (near initialization for
> `ompi_request_functions.req_test_some')
> ../../ompi/request/request.c:40: error: `ompi_request_default_wait'
> undeclared here (not in a function)
> ../../ompi/request/request.c:40: error: initializer element is not
> constant
> ../../ompi/request/request.c:40: error: (near initialization for
> `ompi_request_functions.req_wait')
> ../../ompi/request/request.c:41: error:
> `ompi_request_default_wait_any' undeclared here (not in a function)
> ../../ompi/request/request.c:41: error: initializer element is not
> constant
> ../../ompi/request/request.c:41: error: (near initialization for
> `ompi_request_functions.req_wait_any')
> ../../ompi/request/request.c:42: error:
> `ompi_request_default_wait_all' undeclared here (not in a function)
> ../../ompi/request/request.c:42: error: initializer element is not
> constant
> ../../ompi/request/request.c:42: error: (near initialization for
> `ompi_request_functions.req_wait_all')
> ../../ompi/request/request.c:44: error:
> `ompi_request_default_wait_some' undeclared here (not in a function)
> ../../ompi/request/request.c:44: error: initializer element is not
> constant
> ../../ompi/request/request.c:44: error: (near initialization for
> `ompi_request_functions.req_wait_some')
> make[3]: *** [request/request.lo] Error 1
> make[3]: *** Waiting for unfinished jobs....
> libtool: compile: gcc -DHAVE_CONFIG_H -I. -I../opal/include -I../
> orte/include -I../ompi/include -I../opal/mca/paffinity/linux/plpa/
> src/libplpa -I../../ompi -I../.. -I.. -I../../opal/include -I../../
> orte/include -I../../ompi/include -O3 -DNDEBUG -finline-functions -
> fno-strict-aliasing -pthread -MT request/req_test.lo -MD -MP -MF
> request/.deps/req_test.Tpo -c ../../ompi/request/req_test.c -fPIC -
> DPIC -o request/.libs/req_test.o
> ../../ompi/request/req_test.c:23:42: ompi/request/request_default.h:
> No such file or directory
> make[3]: *** [request/req_test.lo] Error 1
> make[2]: *** [all-recursive] Error 1
> make[2]: Leaving directory `/home/mpiteam/openmpi/nightly-tarball-
> build-root/trunk/create-r16872/ompi/openmpi-1.3a1r16872/_build/ompi'
> make[1]: *** [all-recursive] Error 1
> make[1]: Leaving directory `/home/mpiteam/openmpi/nightly-tarball-
> build-root/trunk/create-r16872/ompi/openmpi-1.3a1r16872/_build'
> make: *** [distcheck] Error 2
> =
> ======================================================================
>
> Your friendly daemon,
> Cyrador
> _______________________________________________
> testing mailing list
> testing_at_[hidden]
> http://www.open-mpi.org/mailman/listinfo.cgi/testing



  • application/pkcs7-signature attachment: smime.p7s